program: Orca
programVersion: 5.0.2
elementType: N N N C C C C C C C C C C C C C H H H H H H H H H H H H H H H H H H H H H H H H H H H H H
charge: 0
multiplicity: 1
keywords: wb97x-d3
keywords: def2-TZVPP
keywords: def2/J RIJCOSX
keywords: DEFGRID2
keywords: scfconv7
keywords: smallprint printgap noloewdin
keywords: NOSOSCF
formula: C13H29N3
InChI: InChI=1/C13H29N3/c1-2-3-4-5-6-7-8-9-10-11-12-16-13(14)15/h2-12,14-15H2,1H3
45 atoms
N  0.094637 2.010042 -0.591625
N  -0.828084 3.331666 1.17207
N  1.347531 2.611524 1.237462
C  -1.133247 -1.7866 0.969062
C  -0.18331 -2.981046 0.984305
C  -2.271296 -1.908234 -0.038375
C  0.542686 -3.245949 -0.335404
C  -3.269263 -0.751076 0.016358
C  1.29824 -2.050609 -0.912984
C  -2.644749 0.635907 -0.12782
C  2.366911 -1.473565 0.006308
C  -1.897799 0.854737 -1.43772
C  3.134927 -0.323386 -0.633529
C  -1.046498 2.123308 -1.456158
C  4.221695 0.237861 0.27341
C  0.162988 2.617258 0.522466
H  -0.562325 -0.873157 0.774919
H  -1.558203 -1.661466 1.970875
H  -0.739279 -3.881863 1.263228
H  0.552687 -2.832935 1.779817
H  -2.810574 -2.844444 0.139162
H  -1.865248 -1.9941 -1.049996
H  -0.172643 -3.603025 -1.081699
H  1.243623 -4.072927 -0.183822
H  -4.024352 -0.896398 -0.762667
H  -3.808217 -0.791722 0.968125
H  1.767511 -2.358467 -1.852799
H  0.598187 -1.253219 -1.181375
H  -3.436286 1.388159 -0.037537
H  -1.971354 0.811683 0.714196
H  3.064796 -2.265688 0.301984
H  1.906986 -1.115341 0.933622
H  -2.612225 0.887331 -2.266386
H  -1.229544 0.014761 -1.641929
H  2.42492 0.461756 -0.911962
H  3.588798 -0.663567 -1.569338
H  -0.679136 2.272464 -2.475442
H  -1.693517 2.994278 -1.253005
H  4.734373 1.08413 -0.185082
H  3.814138 0.577879 1.229136
H  4.975315 -0.516822 0.504448
H  -0.516995 4.165642 1.64212
H  -1.681061 3.468453 0.6582
H  1.246199 2.45272 2.227393
H  2.039058 2.010266 0.818807
totalener: -677.20187417 hartree
nucrepener: 1220.67918100 hartree
electener: -1897.88105517 hartree
oneelecener: -3339.39832865 hartree
twoeener: 1441.51727348 hartree
kineticenergy: 673.81896167 hartree
xcener: -69.488399261475 hartree
chargesum: -0.0000000
charge: -0.384324 -0.316837 -0.329431 -0.078700 -0.168145 -0.147559 -0.152326 -0.156634 -0.086246 -0.157912 -0.114877 -0.110436 -0.126777 -0.052819 -0.264976 0.347900 0.027442 0.076105 0.070520 0.074845 0.071720 0.067403 0.075243 0.070599 0.068983 0.069778 0.071177 0.045842 0.071460 0.080517 0.063996 0.043839 0.076459 0.078257 0.062758 0.063423 0.089695 0.037835 0.097722 0.049626 0.082270 0.142180 0.153532 0.136006 0.180868
qa: -0.3843 -0.3168 -0.3294 -0.0787 -0.1681 -0.1476 -0.1523 -0.1566 -0.0862 -0.1579 -0.1149 -0.1104 -0.1268 -0.0528 -0.2650 0.3479 0.0274 0.0761 0.0705 0.0748 0.0717 0.0674 0.0752 0.0706 0.0690 0.0698 0.0712 0.0458 0.0715 0.0805 0.0640 0.0438 0.0765 0.0783 0.0628 0.0634 0.0897 0.0378 0.0977 0.0496 0.0823 0.1422 0.1535 0.1360 0.1809
va: 2.9250 3.1265 3.1123 3.8387 3.9220 3.8731 3.8918 3.9498 3.8687 3.8892 3.8429 3.8009 3.8619 3.9623 3.9256 4.1588 1.0178 1.0118 1.0112 1.0021 1.0142 1.0013 1.0050 1.0102 1.0096 1.0083 1.0138 1.0233 1.0091 1.0020 1.0139 1.0107 1.0178 1.0082 1.0418 1.0126 1.0046 1.0131 1.0039 1.0080 1.0036 1.0354 1.0377 1.0305 1.0417
dispcorr: -0.022336597 hartree
energy: -677.224210767344
dipole: 2.12902 -2.50127 -0.37225 -9.10217 9.67678 0.57462 -0.34881 0.91260 0.56378
magnitude: 0.88691 au
magnitude: 2.25434 debye
