program: Orca
programVersion: 5.0.2
elementType: O O O N N N N C C C C C C C H H H H H H H H H H
charge: 0
multiplicity: 1
keywords: wb97x-d3
keywords: def2-TZVPP
keywords: def2/J RIJCOSX
keywords: DEFGRID2
keywords: scfconv7
keywords: smallprint printgap noloewdin
keywords: NOSOSCF
formula: C7H10N4O3
InChI: InChI=1/C7H10N4O3/c1-3-9-7(13)10-6(12)5(4-8)11-14-2/h9-10H,3H2,1-2H3
24 atoms
O  2.342932 1.85709 0.234358
O  0.23703 -1.658986 -0.469955
O  -3.496653 0.82059 0.07445
N  2.656278 -0.322242 -0.303621
N  0.514083 0.560365 0.020075
N  -2.184002 0.7754 0.060743
N  -3.117735 -2.485374 -0.564994
C  4.104903 -0.259624 -0.340876
C  4.752355 -0.382969 1.027335
C  1.911101 0.741508 -0.004029
C  -0.208487 -0.556392 -0.219638
C  -1.686726 -0.377758 -0.162652
C  -2.477063 -1.547967 -0.385678
C  -3.979471 2.143044 0.334795
H  4.435309 -1.073803 -0.985031
H  4.412997 0.666615 -0.826241
H  2.207837 -1.21629 -0.43794
H  4.475726 -1.319681 1.512888
H  5.838596 -0.366525 0.928869
H  4.465861 0.439767 1.682911
H  0.002505 1.410177 0.227069
H  -5.059771 2.083843 0.221346
H  -3.572047 2.853637 -0.385867
H  -3.731377 2.450367 1.35213
elementType: O N C H
totalener: -717.49571661 hartree
nucrepener: 862.20764635 hartree
electener: -1579.70336296 hartree
oneelecener: -2686.87384535 hartree
twoeener: 1107.17048239 hartree
cpcmener: -0.03090510 hartree
kineticenergy: 714.61586384 hartree
xcener: -66.038917471852 hartree
chargesum: 0.0000000
charge: -0.524304 -0.454487 -0.181039 -0.227339 -0.145389 -0.075142 -0.054806 -0.010711 -0.242588 0.411626 0.331877 0.296052 -0.215181 -0.110024 0.096857 0.088214 0.196226 0.082278 0.090343 0.082893 0.186373 0.127116 0.124709 0.126446
qa: -0.5243 -0.4545 -0.1810 -0.2273 -0.1454 -0.0751 -0.0548 -0.0107 -0.2426 0.4116 0.3319 0.2961 -0.2152 -0.1100 0.0969 0.0882 0.1962 0.0823 0.0903 0.0829 0.1864 0.1271 0.1247 0.1264
va: 1.9919 2.0523 2.0806 3.1925 3.2101 2.9554 3.0885 3.8661 3.9038 4.3434 4.3142 3.7591 4.0920 3.8453 0.9996 1.0109 1.0335 1.0065 1.0072 1.0119 1.0337 0.9919 0.9930 0.9910
dispcorr: -0.007768895 hartree
energy: -717.503485501575
dipole: 12.70833 -13.06074 -0.35241 5.62707 -4.12594 1.50113 3.42815 -3.12106 0.30709
magnitude: 1.57222 au
magnitude: 3.99628 debye
