program: Orca
programVersion: 5.0.2
elementType: O O O N N N N C C C C C C C H H H H H H H H H H
charge: 0
multiplicity: 1
keywords: wb97x-d3
keywords: def2-TZVPP
keywords: def2/J RIJCOSX
keywords: DEFGRID2
keywords: scfconv7
keywords: smallprint printgap noloewdin
keywords: NOSOSCF
formula: C7H10N4O3
InChI: InChI=1/C7H10N4O3/c1-3-9-7(13)10-6(12)5(4-8)11-14-2/h9-10H,3H2,1-2H3
24 atoms
O  2.27007 2.049384 0.075734
O  0.30855 -1.619102 0.215908
O  -3.501105 0.782505 -0.133963
N  2.676074 -0.173412 0.318618
N  0.502587 0.660433 0.114078
N  -2.190029 0.779704 -0.050994
N  -3.020237 -2.565884 0.030713
C  4.123498 -0.096445 0.33148
C  4.74359 -0.698555 -0.916297
C  1.89159 0.893642 0.165103
C  -0.175869 -0.50811 0.131629
C  -1.657137 -0.376328 0.030013
C  -2.408142 -1.592925 0.028738
C  -4.022517 2.111978 -0.232525
H  4.416876 0.945427 0.436675
H  4.486151 -0.617361 1.219314
H  2.253364 -1.090007 0.355195
H  4.475545 -1.750321 -1.0271
H  4.422965 -0.169313 -1.814218
H  5.831229 -0.638734 -0.861169
H  -0.04082 1.511619 0.031985
H  -3.76866 2.694118 0.653026
H  -5.100886 1.996181 -0.298078
H  -3.650848 2.607249 -1.129229
elementType: O N C H
totalener: -717.49525476 hartree
nucrepener: 861.16751305 hartree
electener: -1578.66276781 hartree
oneelecener: -2684.75138852 hartree
twoeener: 1106.08862070 hartree
cpcmener: -0.03057498 hartree
kineticenergy: 714.62573674 hartree
xcener: -66.041283747804 hartree
chargesum: 0.0000000
charge: -0.522543 -0.454007 -0.181629 -0.222204 -0.147405 -0.075172 -0.054408 -0.002816 -0.243218 0.403668 0.329504 0.297861 -0.214796 -0.110994 0.087824 0.095498 0.192921 0.084464 0.084323 0.087887 0.185866 0.125838 0.127338 0.126200
qa: -0.5225 -0.4540 -0.1816 -0.2222 -0.1474 -0.0752 -0.0544 -0.0028 -0.2432 0.4037 0.3295 0.2979 -0.2148 -0.1110 0.0878 0.0955 0.1929 0.0845 0.0843 0.0879 0.1859 0.1258 0.1273 0.1262
va: 1.9971 2.0532 2.0807 3.2010 3.2027 2.9555 3.0887 3.8442 3.9355 4.3551 4.3198 3.7553 4.0926 3.8451 1.0249 0.9985 1.0328 1.0043 1.0046 1.0076 1.0347 0.9920 0.9920 0.9919
dispcorr: -0.007625746 hartree
energy: -717.502880507844
dipole: 12.46754 -12.83027 -0.36273 4.99177 -3.48472 1.50705 -2.29279 2.21905 -0.07375
magnitude: 1.55184 au
magnitude: 3.94446 debye
