program: Orca
programVersion: 5.0.4
elementType: F F F F F O O N N C C C C C C C C C C C C C C C C C C C C H H H H H H H H H H H H H H H H H
charge: 0
multiplicity: 1
keywords: wb97x-d3
keywords: def2-TZVPP
keywords: def2/J RIJCOSX
keywords: DEFGRID2
keywords: scfconv7
keywords: smallprint printgap noloewdin
keywords: NOSOSCF
formula: C20H17F5N2O2
InChI: InChI=1/C20H17F5N2O2/c21-15-9-8-14(20(23,24)25)17(18(15)22)19(27-29-11-13-6-7-13)26-16(28)10-12-4-2-1-3-5-12/h1-5,8-9,13,26H,6-7,10-11H2
46 atoms
F  2.677947 0.589571 2.31017
F  0.16354 0.159241 -2.254618
F  1.16737 -1.577638 -3.014791
F  -0.115911 -1.745536 -1.301274
F  5.157189 0.243553 1.398584
O  -1.185728 -0.704489 2.258971
O  1.224786 2.443345 -0.240578
N  0.044179 -0.941865 1.713669
N  -0.379133 1.061263 0.573996
C  -2.256815 -2.844092 1.807532
C  -1.351455 -3.850384 1.16584
C  -2.363856 -4.293846 2.173939
C  -1.723364 -1.892735 2.833499
C  0.406914 -0.021387 0.91129
C  1.750842 -0.195096 0.305357
C  1.963681 -0.674985 -0.991528
C  2.849488 0.101103 1.083473
C  0.052612 2.215989 -0.014206
C  -1.033576 3.226375 -0.311171
C  3.255172 -0.846519 -1.464812
C  0.798053 -0.96571 -1.890197
C  -2.355897 2.645395 -0.726813
C  4.136494 -0.068519 0.605078
C  4.348835 -0.543865 -0.6670
C  -3.403204 2.526105 0.182282
C  -2.54636 2.205277 -2.03562
C  -4.618793 1.976559 -0.206085
C  -3.760707 1.661898 -2.426471
C  -4.80008 1.54357 -1.511437
H  -3.055731 -2.447047 1.189829
H  -0.30997 -3.856319 1.460528
H  -1.523249 -4.095116 0.125719
H  -2.007556 -4.595363 3.151759
H  -3.232578 -4.839444 1.830108
H  -0.969868 -2.377013 3.462259
H  -2.524285 -1.538035 3.484011
H  -1.362553 0.987296 0.804587
H  -0.644136 3.892307 -1.081254
H  -1.153278 3.829173 0.5944
H  3.438874 -1.220613 -2.461141
H  5.356218 -0.678179 -1.037031
H  -3.268816 2.871559 1.200715
H  -1.743379 2.301614 -2.75647
H  -5.424413 1.893347 0.511659
H  -3.897452 1.329537 -3.447344
H  -5.747484 1.119555 -1.817581
elementType: F O N C H
totalener: -1531.65803035 hartree
nucrepener: 2970.94023977 hartree
electener: -4502.59827012 hartree
oneelecener: -8012.29760967 hartree
twoeener: 3509.69933955 hartree
cpcmener: -0.03499329 hartree
kineticenergy: 1525.79105992 hartree
xcener: -138.190174557811 hartree
chargesum: 0.0000000
charge: -0.199305 -0.172420 -0.172762 -0.172396 -0.199142 -0.268151 -0.492258 -0.161369 -0.155702 -0.077291 -0.169776 -0.208290 0.053208 0.231585 -0.069001 -0.106992 0.248288 0.336820 -0.033202 -0.089603 0.539469 0.007432 0.198076 -0.162071 -0.201273 -0.229717 -0.145696 -0.136301 -0.168657 0.089599 0.078424 0.094697 0.089951 0.097646 0.089097 0.104142 0.200549 0.110177 0.126161 0.153961 0.161553 0.151945 0.143796 0.161436 0.161559 0.161803
qa: -0.1993 -0.1724 -0.1728 -0.1724 -0.1991 -0.2682 -0.4923 -0.1614 -0.1557 -0.0773 -0.1698 -0.2083 0.0532 0.2316 -0.0690 -0.1070 0.2483 0.3368 -0.0332 -0.0896 0.5395 0.0074 0.1981 -0.1621 -0.2013 -0.2297 -0.1457 -0.1363 -0.1687 0.0896 0.0784 0.0947 0.0900 0.0976 0.0891 0.1041 0.2005 0.1102 0.1262 0.1540 0.1616 0.1519 0.1438 0.1614 0.1616 0.1618
va: 1.1072 1.1182 1.1344 1.1234 1.0971 1.9411 2.0070 2.8799 3.2571 3.7710 3.8738 3.9483 3.8626 3.9571 3.7505 3.7305 3.9318 4.1192 3.7761 3.8927 4.4173 3.5812 4.0205 3.9030 3.9013 3.9432 3.8795 3.8747 3.9020 1.0147 1.0314 1.0182 1.0146 1.0152 1.0144 0.9998 1.0113 1.0213 1.0009 1.0036 0.9935 1.0015 1.0084 0.9892 0.9888 0.9887
dispcorr: -0.024513530 hartree
energy: -1531.682543882548
dipole: -35.04118 33.49033 -1.55084 -4.79475 4.37368 -0.42108 7.55664 -7.88818 -0.33154
magnitude: 1.64084 au
magnitude: 4.17067 debye
