program: Gaussian 09
title: 000005045
version: EM64L-G09RevD.01
frameworkgroup: C1[X(C22H20N2O4)]
method: RPBEPBE
basis: SDD
operation: Freq
keyword: #p
keyword: freq=noraman
keyword: PBEPBE/SDD
title: #p freq=noraman PBEPBE/SDD
converged: YES YES NO NO
title: Mulliken charges:
elementType: O O O O N N C C C C C C C C C C C C C C C C C C C C C C H H H H H H H H H H H H H H H H H H H H
charge: -0.293251 -0.273552 -0.489909 -0.302137 -0.374527 -0.474093 0.503975 -0.531599 0.264460 -0.390968 -0.450348 -0.344482 -0.348855 0.125770 0.347907 0.467333 -0.476618 0.324815 0.107772 -0.318782 -0.366170 -0.388006 -0.347984 -0.236544 -0.224505 -0.228961 -0.226057 -0.233015 0.268228 0.232510 0.249061 0.236759 0.217218 0.276528 0.324918 0.359740 0.219558 0.243919 0.312823 0.273153 0.232261 0.218454 0.228635 0.228337 0.226858 0.228180 0.229429 0.371762
chargesum: 0.00000
title: Mulliken charges with hydrogens summed into heavy atoms:
elementType: O O O O N N C C C C C C C C C C C C C C C C C C C C C C
charge: -0.293251 -0.273552 -0.118147 -0.302137 -0.049609 -0.114353 0.503975 -0.030860 0.264460 -0.141907 -0.213589 -0.127264 -0.072327 0.125770 0.347907 0.467333 -0.013142 0.324815 0.107772 -0.005959 -0.093017 -0.155745 -0.129531 -0.007909 0.003675 -0.000625 0.000801 -0.003586
polarizability: 4.42309569e+02 -3.10956681e+01 2.57718052e+02 4.49443320e+00 5.27741702e-01 1.52346804e+02
1716.lowfreq: -2.9575 -0.0010 0.0012 0.0015 0.8684 4.7586 11.1677 13.9614 21.1992
frequency: 11.0798 13.7460 19.9718 27.7848 37.1562 38.4563 41.6228 62.7025 77.7479 91.8002 112.0300 142.8745 162.7968 176.2006 196.2736 208.5759 226.8646 258.9540 270.8972 286.0766 309.6739 312.8613 328.6298 349.3733 387.5715 403.9872 404.5918 424.4089 447.9850 449.9611 465.9476 499.3745 536.0340 544.6233 558.9953 576.4741 591.0502 608.4506 618.0563 621.3396 633.4159 654.7911 688.2620 697.1853 705.5745 709.6123 735.1508 748.1318 754.3777 760.3267 766.4437 804.3334 815.7549 833.6062 842.7791 848.1127 850.4293 858.7731 866.0210 873.8420 920.1882 934.5117 938.7279 963.7599 975.1498 982.6826 987.0806 990.1701 994.7871 1000.9025 1011.0776 1024.1500 1027.9718 1033.1262 1063.5194 1091.7649 1095.1210 1104.5062 1125.8221 1141.6762 1169.7263 1173.4245 1189.3804 1194.3028 1197.3461 1208.9824 1220.9782 1223.0745 1238.2094 1243.0757 1253.3761 1267.6280 1307.4039 1318.1031 1330.9695 1339.6771 1349.9167 1385.9188 1391.4523 1402.4352 1410.5535 1439.2900 1443.0466 1460.8314 1468.9874 1484.4558 1488.2990 1489.8051 1504.3581 1523.1345 1566.9099 1594.7866 1602.4631 1605.0276 1614.9732 1620.3213 1624.6701 1657.0345 2982.1758 3035.4876 3040.6479 3109.4306 3118.0261 3118.4146 3118.7844 3124.1578 3127.4699 3140.1375 3143.2684 3148.1361 3151.5201 3163.3229 3164.7287 3166.0361 3196.9036 3515.6567 3567.3369 3616.2239
redmass: 6.1071 5.5937 5.1616 5.2477 5.7769 4.1076 4.8382 5.9442 8.3098 6.0694 5.8440 5.8083 5.3873 5.3980 6.1040 4.8638 5.4364 5.9030 6.6479 3.0159 1.6800 2.6222 3.4148 3.4143 2.8214 2.8291 2.8195 5.3226 3.9300 3.4770 3.6431 3.9010 7.5258 3.5322 3.6016 3.8068 2.3205 2.0689 6.1954 5.1097 6.4617 5.1842 3.5958 7.2392 1.9318 1.5638 3.1718 1.5636 1.8178 2.3313 5.4263 4.7591 3.4614 2.8314 2.4036 1.3785 3.1531 1.2478 1.4891 5.9997 3.1069 1.3446 1.7501 1.4023 1.8002 1.4141 1.2996 5.3263 1.4035 1.3404 3.0264 2.3915 2.2340 2.0963 2.7645 1.5240 3.6189 3.4847 1.4485 1.2450 1.0718 1.0543 1.1624 1.2298 1.8631 2.0084 2.1618 2.8241 1.1569 1.3410 3.1798 1.8534 1.4006 1.7230 1.2578 1.4591 1.4513 8.0530 3.2340 6.5709 2.7887 2.6106 2.1791 1.1359 1.1074 2.2467 2.3249 1.9029 2.6529 2.3812 6.1517 6.0943 5.6571 6.5268 6.0695 5.8887 6.1798 8.8506 1.0619 1.0585 1.0992 1.1072 1.0872 1.0889 1.0879 1.0897 1.0871 1.0920 1.0890 1.0952 1.0961 1.0948 1.1015 1.0979 1.0953 1.0758 1.0774 1.0665
irintensity: 0.6783 0.9853 0.5622 0.3249 0.9325 0.2026 1.2146 0.9433 8.7006 1.9412 5.7646 1.8041 2.5869 0.4426 0.4726 3.0314 3.2633 13.5348 2.8186 33.9925 84.6214 33.3976 10.9763 19.7203 9.6161 0.5078 0.1265 4.6277 8.5415 13.0214 4.5547 20.2621 6.8550 8.2490 4.1241 68.8483 75.1420 42.5280 1.8334 8.4268 2.3840 10.1462 4.6914 21.5690 57.7420 26.5213 12.2532 44.5410 93.7320 101.6437 13.4016 10.6159 9.7622 14.2132 29.5998 2.5233 30.9380 0.3056 20.1227 16.9037 144.0759 6.9782 18.3284 7.1613 20.2148 1.5312 3.5201 0.1686 1.5298 0.8739 2.2895 127.8515 4.3972 16.6961 102.3984 8.5767 43.3587 115.9364 23.6142 47.8813 1.2306 0.0096 40.1475 28.0245 295.4895 10.7657 3.7190 30.4498 12.5708 92.8145 104.5971 74.6238 21.6968 79.0429 2.6987 7.6090 9.6050 0.8450 7.1582 50.1763 7.2273 144.7361 9.8001 12.2839 37.1545 17.6736 35.7413 490.2791 100.1025 477.7103 37.0348 2.1829 71.5997 5.8215 0.6515 68.1882 11.3041 287.7553 35.7199 32.4252 15.4285 5.4058 6.8359 13.6529 18.6194 15.1641 1.7975 21.2969 10.8830 9.9882 23.9129 3.5283 24.9559 25.2011 8.2696 33.4289 34.6837 42.5867
temp: 298.150 k
press: 1.00000 atm
elementType: 8 8 8 8 7 7 6 6 6 6 6 6 6 6 6 6 6 6 6 6 6 6 6 6 6 6 6 6 1 1 1 1 1 1 1 1 1 1 1 1 1 1 1 1 1 1 1 1
symmnumber: 1
zpe: 983981.2 jmol-1
zpe.correction: 0.374779 hartree
zpe.thermalcorrener: 0.399717 hartree
zpe.thermalcorrenthalpy: 0.400661 hartree
zpe.thermalcorrgfe: 0.314461 hartree
zpe.sumelectzpe: -1258.798260 hartree
zpe.sumelectthermal: -1258.773322 hartree
zpe.sumelectthermalent: -1258.772378 hartree
zpe.sumelectthermalfe: -1258.858578 hartree
dipole: -0.8857 -4.2774 -1.6840
dipole: 4.6815
quadrupole: -146.0975 -144.1857 -168.2412
quadrupole: -26.6557 10.2005 -1.6377
quadrupole: 6.7440 8.6558 -15.3998 -26.6557 10.2005 -1.6377
hfenergy: -1259.1730389 hartree
pointgroup: C01 [X(C22H20N2O4)]
dipole: 0.3034435 1.8166313 -0.0138929 debye
polarizability: 443.8445236|-22.8087187|243.3490484|-13.4468855|34.1847083|165.180854 unknown
InChI: InChI=1S/C22H20N2O4/c25-20-9-5-4-8-19(20)24-21(26)18-12-10-16(11-13-18)14-23-22(27)28-15-17-6-2-1-3-7-17/h1-13,23-25H,14-15H2
charge 0 multiplicity 1
48 atoms
O  4.053329 1.226414 0.091723
O  -4.670736 -2.127965 -1.098398
O  -5.109881 2.335809 0.976317
O  3.828249 -0.717943 1.421325
N  2.604876 -0.395403 -0.559899
N  -4.563898 -0.01809 -0.082455
C  0.360246 -1.499546 -0.537365
C  1.876349 -1.669031 -0.513989
C  -2.483189 -1.236044 -0.541312
C  -0.2765 -0.534571 0.283328
C  -0.443016 -2.334292 -1.352984
C  -1.679443 -0.403187 0.284062
C  -1.846101 -2.209591 -1.350667
C  -3.989668 -1.177307 -0.597722
C  -5.939646 0.29249 0.04328
C  6.510812 1.245506 0.534892
C  5.147254 1.704549 1.005509
C  3.520276 -0.038989 0.404696
C  -6.24066 1.562929 0.616696
C  -7.011158 -0.548787 -0.347819
C  7.026617 -0.010135 0.950139
C  7.288942 2.06234 -0.324316
C  -7.567361 1.98962 0.800823
C  -8.345297 -0.120075 -0.161286
C  -8.62973 1.140372 0.408636
C  8.296558 -0.440665 0.506883
C  8.559882 1.63281 -0.767671
C  9.066194 0.379212 -0.351965
H  2.196352 -2.167512 0.420687
H  2.190337 -2.319717 -1.353735
H  0.33355 0.107662 0.928388
H  0.033312 -3.086576 -1.993693
H  -2.132078 0.32923 0.963693
H  -2.478614 -2.856918 -1.96649
H  2.458288 0.24831 -1.338472
H  -3.944801 0.733789 0.232897
H  5.043031 2.800027 0.959594
H  4.921801 1.335036 2.020683
H  -6.779007 -1.518322 -0.79136
H  6.41961 -0.644606 1.605786
H  6.896681 3.034836 -0.647187
H  -7.774991 2.971558 1.245184
H  -9.164337 -0.779339 -0.46681
H  8.687179 -1.411412 0.832086
H  9.154148 2.272247 -1.430032
H  -9.665206 1.466847 0.549156
H  10.052978 0.045429 -0.692544
H  -5.373534 3.2049 1.362508
