program: Orca
programVersion: 5.0.4
elementType: F F F F F O O N N C C C C C C C C C C C C C C C C C C C C H H H H H H H H H H H H H H H H H
charge: 0
multiplicity: 1
keywords: wb97x-d3
keywords: def2-TZVPP
keywords: def2/J RIJCOSX
keywords: DEFGRID2
keywords: scfconv7
keywords: smallprint printgap noloewdin
keywords: NOSOSCF
formula: C20H17F5N2O2
InChI: InChI=1/C20H17F5N2O2/c21-15-9-8-14(20(23,24)25)17(18(15)22)19(27-29-11-13-6-7-13)26-16(28)10-12-4-2-1-3-5-12/h1-5,8-9,13,26H,6-7,10-11H2
46 atoms
F  2.802183 0.948481 2.158602
F  -0.130112 -0.379781 -1.692753
F  1.205927 -1.403537 -3.026723
F  0.473707 -2.400385 -1.273874
F  5.280775 0.706331 1.166996
O  -0.992456 -0.929823 2.23068
O  1.050365 2.422585 -0.45032
N  0.203369 -1.096158 1.581867
N  -0.190091 1.115976 0.940608
C  -2.161531 -2.803727 1.217364
C  -3.441768 -3.57714 1.292504
C  -3.413648 -2.240924 0.617598
C  -1.615212 -2.189505 2.468678
C  0.561392 -0.036839 0.966965
C  1.881027 -0.114155 0.291113
C  2.079942 -0.704903 -0.957769
C  2.97805 0.363024 0.975856
C  0.020738 2.221667 0.15945
C  -1.165472 3.16021 0.123756
C  3.360838 -0.817466 -1.476979
C  0.909796 -1.223426 -1.739069
C  -2.380089 2.451191 -0.420055
C  4.254566 0.244812 0.458213
C  4.454428 -0.345979 -0.767616
C  -2.42533 2.082084 -1.763289
C  -3.436132 2.095116 0.412676
C  -3.502494 1.363742 -2.26018
C  -4.516803 1.376457 -0.083936
C  -4.549726 1.004218 -1.420027
H  -1.420441 -3.178873 0.520592
H  -3.935133 -3.650363 2.253962
H  -3.531975 -4.463395 0.678125
H  -3.887357 -1.407403 1.122985
H  -3.489182 -2.206274 -0.461706
H  -0.908648 -2.860562 2.965563
H  -2.420098 -1.968638 3.171787
H  -1.088325 1.051112 1.403691
H  -0.89739 4.016055 -0.494558
H  -1.360532 3.527877 1.134503
H  3.53403 -1.274409 -2.44037
H  5.454777 -0.437012 -1.168477
H  -1.611343 2.356046 -2.424257
H  -3.411542 2.377685 1.458571
H  -3.523249 1.080219 -3.304433
H  -5.330688 1.106293 0.576165
H  -5.388374 0.440443 -1.807305
elementType: F O N C H
totalener: -1531.65903292 hartree
nucrepener: 3003.69084019 hartree
electener: -4535.34987311 hartree
oneelecener: -8077.87805642 hartree
twoeener: 3542.52818332 hartree
cpcmener: -0.03580930 hartree
kineticenergy: 1525.79507876 hartree
xcener: -138.190232576901 hartree
chargesum: -0.0000000
charge: -0.200491 -0.175729 -0.173853 -0.172721 -0.199333 -0.274104 -0.479719 -0.175890 -0.163801 -0.092769 -0.196881 -0.189387 0.078110 0.257520 -0.088825 -0.096047 0.259387 0.349581 -0.061907 -0.094773 0.543456 0.027057 0.196549 -0.164688 -0.235220 -0.188522 -0.120912 -0.168817 -0.175424 0.091126 0.090944 0.096668 0.090932 0.096798 0.089587 0.096967 0.190351 0.105936 0.130368 0.153034 0.161225 0.146522 0.150831 0.161763 0.163519 0.161586
qa: -0.2005 -0.1757 -0.1739 -0.1727 -0.1993 -0.2741 -0.4797 -0.1759 -0.1638 -0.0928 -0.1969 -0.1894 0.0781 0.2575 -0.0888 -0.0960 0.2594 0.3496 -0.0619 -0.0948 0.5435 0.0271 0.1965 -0.1647 -0.2352 -0.1885 -0.1209 -0.1688 -0.1754 0.0911 0.0909 0.0967 0.0909 0.0968 0.0896 0.0970 0.1904 0.1059 0.1304 0.1530 0.1612 0.1465 0.1508 0.1618 0.1635 0.1616
va: 1.1039 1.1165 1.1319 1.1207 1.0972 1.9228 2.0118 2.9077 3.2608 3.7706 3.9611 3.8778 3.8592 3.9686 3.7575 3.7199 3.9290 4.0948 3.7813 3.9068 4.4153 3.5646 4.0214 3.9087 3.9050 3.8923 3.8600 3.8380 3.8635 1.0206 1.0167 1.0145 1.0205 1.0194 1.0151 0.9974 1.0260 1.0238 1.0076 1.0044 0.9934 1.0080 0.9999 0.9878 0.9884 0.9892
dispcorr: -0.026195725 hartree
energy: -1531.685228640582
dipole: -40.22926 38.86891 -1.36035 -2.73983 2.45664 -0.28319 5.67986 -5.58440 0.09545
magnitude: 1.39279 au
magnitude: 3.54020 debye
