program: Orca
programVersion: 5.0.4
elementType: F F F F F O O N N C C C C C C C C C C C C C C C C C C C C H H H H H H H H H H H H H H H H H
charge: 0
multiplicity: 1
keywords: wb97x-d3
keywords: def2-TZVPP
keywords: def2/J RIJCOSX
keywords: DEFGRID2
keywords: scfconv7
keywords: smallprint printgap noloewdin
keywords: NOSOSCF
formula: C20H17F5N2O2
InChI: InChI=1/C20H17F5N2O2/c21-15-9-8-14(20(23,24)25)17(18(15)22)19(27-29-11-13-6-7-13)26-16(28)10-12-4-2-1-3-5-12/h1-5,8-9,13,26H,6-7,10-11H2
46 atoms
F  2.293034 -0.712065 -2.231053
F  -0.285245 0.544973 1.917536
F  0.801973 -1.056639 2.852886
F  1.255073 0.984165 3.345551
F  4.648504 0.489903 -1.821646
O  -0.735757 -2.974406 -0.292517
O  0.068823 1.622836 -1.1691
N  0.434547 -2.331978 0.000586
N  -0.720309 -0.483889 -0.842143
C  -1.949099 -4.997152 -0.324009
C  -2.425341 -6.157812 0.495004
C  -3.131668 -4.841991 0.583731
C  -0.650054 -4.357726 0.048568
C  0.390897 -1.09258 -0.297461
C  1.634798 -0.328281 -0.016323
C  1.937802 0.224877 1.229733
C  2.569482 -0.219337 -1.024959
C  -0.851423 0.830496 -1.187863
C  -2.247803 1.220704 -1.616501
C  3.163212 0.839407 1.442598
C  0.931283 0.172352 2.339087
C  -2.571832 2.612743 -1.156499
C  3.784832 0.405203 -0.81337
C  4.094512 0.928131 0.420715
C  -2.651491 3.668283 -2.056377
C  -2.763509 2.864523 0.200868
C  -2.917797 4.957434 -1.610244
C  -3.021288 4.150613 0.649557
C  -3.098295 5.201946 -0.256603
H  -2.152189 -5.041722 -1.388666
H  -1.816947 -6.467404 1.336108
H  -2.916048 -6.972468 -0.021008
H  -3.006226 -4.255379 1.485615
H  -4.109409 -4.755187 0.12778
H  0.181379 -4.818818 -0.492408
H  -0.46037 -4.466573 1.121404
H  -1.546461 -1.064189 -0.909602
H  -2.982109 0.505889 -1.240507
H  -2.281385 1.159415 -2.708173
H  3.414554 1.261078 2.404765
H  5.051142 1.406783 0.582056
H  -2.505981 3.481539 -3.113646
H  -2.704885 2.047633 0.911466
H  -2.979327 5.770522 -2.321984
H  -3.160229 4.334149 1.707191
H  -3.29774 6.206431 0.093084
elementType: F O N C H
totalener: -1531.66005170 hartree
nucrepener: 2871.08576151 hartree
electener: -4402.74581321 hartree
oneelecener: -7812.75391779 hartree
twoeener: 3410.00810458 hartree
cpcmener: -0.04045111 hartree
kineticenergy: 1525.78091872 hartree
xcener: -138.186815579987 hartree
chargesum: 0.0000000
charge: -0.200556 -0.177088 -0.173866 -0.173559 -0.199560 -0.255325 -0.494449 -0.171000 -0.143426 -0.094086 -0.201124 -0.173174 0.061179 0.258086 -0.101053 -0.099617 0.280484 0.332775 -0.033485 -0.099804 0.542834 0.004450 0.185570 -0.156925 -0.173769 -0.204250 -0.163187 -0.158606 -0.162755 0.096958 0.090843 0.097626 0.088367 0.096696 0.088385 0.083300 0.179440 0.120613 0.117664 0.153152 0.161431 0.143031 0.145843 0.160092 0.160049 0.161796
qa: -0.2006 -0.1771 -0.1739 -0.1736 -0.1996 -0.2553 -0.4944 -0.1710 -0.1434 -0.0941 -0.2011 -0.1732 0.0612 0.2581 -0.1011 -0.0996 0.2805 0.3328 -0.0335 -0.0998 0.5428 0.0044 0.1856 -0.1569 -0.1738 -0.2043 -0.1632 -0.1586 -0.1628 0.0970 0.0908 0.0976 0.0884 0.0967 0.0884 0.0833 0.1794 0.1206 0.1177 0.1532 0.1614 0.1430 0.1458 0.1601 0.1600 0.1618
va: 1.1039 1.1188 1.1239 1.1316 1.0965 1.9522 1.9989 2.9110 3.2855 3.8567 3.9330 3.8827 3.8850 3.9437 3.8087 3.7299 3.8953 4.1273 3.7693 3.9024 4.4309 3.6142 4.0276 3.9014 3.9440 3.9384 3.8949 3.8866 3.8871 1.0111 1.0151 1.0158 1.0172 1.0160 1.0051 0.9998 1.0299 1.0116 1.0101 1.0044 0.9934 1.0037 1.0091 0.9903 0.9902 0.9886
dispcorr: -0.021868667 hartree
energy: -1531.681920365472
dipole: -33.83583 32.71135 -1.12448 -11.35145 10.46227 -0.88918 -6.18152 6.28766 0.10614
magnitude: 1.43748 au
magnitude: 3.65379 debye
