program: Orca
programVersion: 5.0.4
elementType: F F F F F O O N N C C C C C C C C C C C C C C C C C C C C H H H H H H H H H H H H H H H H H
charge: 0
multiplicity: 1
keywords: wb97x-d3
keywords: def2-TZVPP
keywords: def2/J RIJCOSX
keywords: DEFGRID2
keywords: scfconv7
keywords: smallprint printgap noloewdin
keywords: NOSOSCF
formula: C20H17F5N2O2
InChI: InChI=1/C20H17F5N2O2/c21-15-9-8-14(20(23,24)25)17(18(15)22)19(27-29-11-13-6-7-13)26-16(28)10-12-4-2-1-3-5-12/h1-5,8-9,13,26H,6-7,10-11H2
46 atoms
F  2.301892 0.611804 2.267548
F  -0.347569 -0.737285 -1.816699
F  1.168477 -1.048068 -3.30384
F  0.866535 -2.510292 -1.759873
F  4.666438 1.346336 1.251494
O  -0.776451 -2.24572 1.952621
O  0.126919 2.015593 0.018637
N  0.383276 -1.894958 1.323397
N  -0.716597 0.150779 1.007463
C  -1.960224 -3.896717 3.152179
C  -3.160903 -4.290917 2.346917
C  -2.432293 -5.318297 3.153757
C  -0.68152 -3.581006 2.448135
C  0.361575 -0.700362 0.879883
C  1.611083 -0.258685 0.209058
C  1.896045 -0.489433 -1.137724
C  2.563397 0.366746 0.984947
C  -0.806937 1.425568 0.52351
C  -2.169434 2.062288 0.674193
C  3.113862 -0.090401 -1.668731
C  0.897965 -1.194952 -2.006482
C  -2.524629 2.827089 -0.570409
C  3.779165 0.75655 0.455247
C  4.060968 0.535042 -0.87278
C  -2.548142 4.216278 -0.58195
C  -2.804951 2.1367 -1.748209
C  -2.848937 4.908072 -1.749418
C  -3.098657 2.824141 -2.915505
C  -3.120867 4.213924 -2.919225
H  -2.142573 -3.327319 4.057371
H  -3.057592 -4.323713 1.269078
H  -4.132383 -3.962865 2.69253
H  -1.83418 -6.051155 2.626067
H  -2.899946 -5.69147 4.055063
H  -0.516923 -4.275292 1.6181
H  0.17055 -3.659351 3.129711
H  -1.549261 -0.24565 1.423264
H  -2.119255 2.735794 1.534123
H  -2.931782 1.315737 0.901811
H  3.350956 -0.260393 -2.708743
H  5.011289 0.846637 -1.284421
H  -2.331256 4.763003 0.32786
H  -2.789998 1.052675 -1.751845
H  -2.866275 5.990187 -1.743586
H  -3.31025 2.275518 -3.824199
H  -3.350435 4.751201 -3.830177
elementType: F O N C H
totalener: -1531.65992079 hartree
nucrepener: 2874.67992497 hartree
electener: -4406.33984576 hartree
oneelecener: -7819.97065262 hartree
twoeener: 3413.63080686 hartree
cpcmener: -0.04029268 hartree
kineticenergy: 1525.79356722 hartree
xcener: -138.189356126582 hartree
chargesum: -0.0000000
charge: -0.200992 -0.177625 -0.173859 -0.173834 -0.199527 -0.258564 -0.494064 -0.168191 -0.144971 -0.097205 -0.172779 -0.199388 0.066859 0.264456 -0.101998 -0.093008 0.277334 0.335124 -0.033566 -0.100812 0.538949 0.015603 0.186396 -0.159480 -0.180726 -0.205978 -0.161678 -0.160820 -0.162323 0.096367 0.088596 0.096240 0.090860 0.097441 0.081854 0.087075 0.178886 0.114843 0.119535 0.152750 0.160891 0.143417 0.145861 0.160283 0.160338 0.161431
qa: -0.2010 -0.1776 -0.1739 -0.1738 -0.1995 -0.2586 -0.4941 -0.1682 -0.1450 -0.0972 -0.1728 -0.1994 0.0669 0.2645 -0.1020 -0.0930 0.2773 0.3351 -0.0336 -0.1008 0.5389 0.0156 0.1864 -0.1595 -0.1807 -0.2060 -0.1617 -0.1608 -0.1623 0.0964 0.0886 0.0962 0.0909 0.0974 0.0819 0.0871 0.1789 0.1148 0.1195 0.1527 0.1609 0.1434 0.1459 0.1603 0.1603 0.1614
va: 1.1040 1.1191 1.1315 1.1220 1.0968 1.9501 1.9998 2.9089 3.2903 3.8588 3.8824 3.9302 3.8824 3.9351 3.8134 3.7139 3.8995 4.1255 3.7760 3.9103 4.4378 3.6085 4.0292 3.9022 3.9492 3.9371 3.8928 3.8877 3.8877 1.0112 1.0170 1.0161 1.0150 1.0160 1.0001 1.0056 1.0287 1.0116 1.0114 1.0044 0.9935 1.0035 1.0094 0.9902 0.9902 0.9888
dispcorr: -0.021924339 hartree
energy: -1531.681845128674
dipole: -33.73306 32.58303 -1.15002 -5.32793 4.71189 -0.61604 11.32278 -10.84504 0.47774
magnitude: 1.38935 au
magnitude: 3.53145 debye
