program: Gaussian 09
title: 000064124
version: EM64L-G09RevD.01
frameworkgroup: C1[X(C10H14N4O2S)]
method: RPBEPBE
basis: SDD
operation: Freq
keyword: #p
keyword: freq=noraman
keyword: PBEPBE/SDD
title: #p freq=noraman PBEPBE/SDD
converged: NO YES NO NO
title: Mulliken charges:
elementType: S O O N N N N C C C C C C C C C C H H H H H H H H H H H H H H
charge: 0.230898 -0.289102 -0.270826 -0.151037 -0.163677 -0.219603 -0.044693 0.119900 0.099150 0.154559 -0.169719 0.205500 -0.645931 -0.615808 -0.600970 -0.554262 -0.665877 0.246000 0.300885 0.246179 0.272979 0.244216 0.244312 0.249737 0.249370 0.268654 0.283003 0.283084 0.231364 0.231367 0.230344
chargesum: 0.00000
title: Mulliken charges with hydrogens summed into heavy atoms:
elementType: S O O N N N N C C C C C C C C C C
charge: 0.230898 -0.289102 -0.270826 -0.151037 -0.163677 -0.219603 -0.044693 0.119900 0.099150 0.154559 -0.169719 0.205500 0.147134 0.145700 0.166790 0.011825 0.027199
polarizability: 2.46986586e+02 -5.28004618e+00 1.75304431e+02 2.10651894e-02 -2.32257621e-02 8.41636795e+01
1716.lowfreq: -6.8448 -5.5209 0.0010 0.0014 0.0023 4.5213 27.8246 46.7927 70.2038
frequency: 27.7868 46.7692 70.2037 75.4431 80.6359 84.0492 109.5991 120.6010 126.9137 136.0105 190.9312 214.3147 229.7784 234.1940 236.5151 254.5653 298.9606 306.0211 348.9162 368.2970 386.1734 394.5369 421.6098 475.5658 500.8866 578.8478 616.8702 629.6153 669.9511 672.7744 702.9373 729.4223 738.3867 778.8890 779.8002 927.4775 958.3963 994.0909 1022.4560 1045.9517 1049.3823 1070.1035 1114.1010 1128.9695 1130.0958 1131.8199 1189.9460 1209.2846 1228.5426 1231.9570 1264.1326 1276.2992 1298.6954 1327.8453 1346.3522 1387.6166 1399.3769 1413.6916 1427.2721 1451.1334 1455.1640 1471.5028 1472.3946 1475.3260 1478.2629 1478.6194 1482.8626 1482.9386 1486.5749 1500.1817 1571.0251 1613.5406 1646.9605 2989.4104 2992.0756 3006.3036 3012.1641 3052.9449 3083.1775 3084.4297 3087.8707 3095.2692 3104.0743 3117.3056 3134.7437 3138.3644 3138.4622
redmass: 3.6966 1.8257 2.2769 1.3599 3.8246 2.6334 2.0583 2.8949 1.1313 2.2064 5.4442 6.8811 3.2209 1.6342 2.0937 3.7199 2.9031 6.1324 3.7067 8.2126 9.7342 6.9459 6.9277 7.1460 8.6350 5.2303 5.4703 10.2616 9.0826 11.6049 11.2517 5.4968 11.3381 1.1117 5.6606 3.4245 5.5663 1.7815 3.1018 1.2103 3.1488 2.2482 2.0598 1.3005 1.2993 1.3014 3.1928 5.8854 2.6866 1.2320 6.0158 1.3117 6.6313 8.6759 4.5201 2.8685 1.2078 1.3061 1.2640 1.1247 1.7260 1.3418 1.0387 1.0474 1.0434 1.0790 1.0505 1.1004 1.0421 2.1931 7.9025 10.6282 9.8375 1.0357 1.0335 1.0335 1.0328 1.0597 1.1026 1.0969 1.1014 1.1025 1.1022 1.1025 1.1088 1.1022 1.1012
irintensity: 0.2319 0.8867 0.0001 0.0770 0.3506 3.0880 1.5538 2.5529 0.3335 13.4619 7.9139 1.0127 4.7524 0.2564 0.6157 0.7451 2.1841 0.3279 13.1084 0.2374 10.5200 20.4606 10.2875 17.2965 9.5599 2.0949 13.7067 2.5993 2.5213 0.2874 6.3622 8.4060 14.8263 9.2175 0.3868 7.0262 36.6213 32.3484 72.7260 0.3839 10.0398 0.6103 55.8314 0.5221 0.2197 0.0535 43.4499 23.8169 2.5927 0.4589 45.8144 55.0345 29.1864 166.8702 140.2316 34.4680 24.2117 26.0579 41.7993 53.9577 116.3598 88.9054 16.1052 17.4774 17.4611 1.0324 11.0148 45.4432 21.5402 144.9019 6.3136 574.2084 503.3477 29.0741 37.1240 34.6019 31.1567 3.5234 15.9858 20.8357 14.8205 19.3741 18.0019 1.7797 18.5475 0.8243 0.4505
temp: 298.150 k
press: 1.00000 atm
elementType: 16 8 8 7 7 7 7 6 6 6 6 6 6 6 6 6 6 1 1 1 1 1 1 1 1 1 1 1 1 1 1
symmnumber: 1
zpe: 629915.9 jmol-1
zpe.correction: 0.239922 hartree
zpe.thermalcorrener: 0.258169 hartree
zpe.thermalcorrenthalpy: 0.259114 hartree
zpe.thermalcorrgfe: 0.192436 hartree
zpe.sumelectzpe: -1155.744803 hartree
zpe.sumelectthermal: -1155.726556 hartree
zpe.sumelectthermalent: -1155.725612 hartree
zpe.sumelectthermalfe: -1155.792290 hartree
dipole: 4.9292 -0.5778 0.0160
dipole: 4.9630
quadrupole: -105.7012 -108.6021 -107.3473
quadrupole: -5.3710 0.0213 0.0168
quadrupole: 1.5156 -1.3852 -0.1304 -5.3710 0.0213 0.0168
hfenergy: -1155.9847254 hartree
pointgroup: C01 [X(C10H14N4O2S1)]
dipole: 1.9426094 -0.1958967 0.0221226 debye
polarizability: 247.128108|-4.1155102|175.151227|1.3067355|-0.3649611|84.1753618 unknown
InChI: InChI=1S/C10H14N4O2S/c1-5-17-9-11-7-6(12(9)2)8(15)14(4)10(16)13(7)3/h5H2,1-4H3
charge 0 multiplicity 1
31 atoms
S  3.581022 0.80842 0.015852
O  -2.065769 2.536702 -0.031233
O  -3.387494 -1.993147 -0.024822
N  0.866361 1.440028 -0.004096
N  -1.082951 -1.547012 -0.007591
N  -2.699062 0.24836 -0.026699
N  1.280427 -0.816375 0.006161
C  -0.384828 0.788699 -0.008725
C  -0.086914 -0.58292 -0.003033
C  -1.723208 1.310131 -0.022535
C  1.822546 0.435569 0.00513
C  -2.443162 -1.151714 -0.020381
C  1.101437 2.893419 -0.001248
C  -0.739618 -2.981647 0.000033
C  -4.130332 0.630054 -0.039841
C  4.253803 -0.977025 0.032905
C  5.785001 -0.917551 0.046042
H  1.680048 3.188606 -0.894043
H  0.121943 3.39552 -0.013779
H  1.658614 3.189081 0.904952
H  -1.682378 -3.547527 -0.005368
H  -0.153267 -3.225633 0.90179
H  -0.139159 -3.23186 -0.890658
H  -4.63983 0.214518 0.844665
H  -4.62082 0.228129 -0.94142
H  -4.175032 1.728813 -0.032898
H  3.836092 -1.463563 0.927152
H  3.852021 -1.474811 -0.86243
H  6.18199 -0.408068 -0.849594
H  6.166292 -0.397125 0.942201
H  6.187925 -1.94677 0.055814
