program: Orca
programVersion: 5.0.4
elementType: F F F F F O O N N C C C C C C C C C C C C C C C C C C C C H H H H H H H H H H H H H H H H H
charge: 0
multiplicity: 1
keywords: wb97x-d3
keywords: def2-TZVPP
keywords: def2/J RIJCOSX
keywords: DEFGRID2
keywords: scfconv7
keywords: smallprint printgap noloewdin
keywords: NOSOSCF
formula: C20H17F5N2O2
InChI: InChI=1/C20H17F5N2O2/c21-15-9-8-14(20(23,24)25)17(18(15)22)19(27-29-11-13-6-7-13)26-16(28)10-12-4-2-1-3-5-12/h1-5,8-9,13,26H,6-7,10-11H2
46 atoms
F  1.283673 0.623312 2.156516
F  1.731315 -1.433665 -3.366331
F  1.252346 -2.904745 -1.88026
F  -0.117506 -1.29549 -2.284484
F  3.784221 1.466129 1.726102
O  -1.466105 -2.540541 1.138957
O  -0.3449 1.647786 -0.772904
N  -0.199694 -2.151723 0.807248
N  -1.225829 -0.078998 0.413858
C  -0.862162 -3.995098 3.004576
C  -0.392754 -5.348322 3.446796
C  0.602523 -4.272177 3.150884
C  -1.475675 -3.872519 1.643914
C  -0.14405 -0.935433 0.432258
C  1.211936 -0.448658 0.074728
C  1.863143 -0.762451 -1.119265
C  1.886063 0.309394 1.01032
C  -1.287137 1.143732 -0.198435
C  -2.653078 1.787987 -0.108037
C  3.157252 -0.316044 -1.344644
C  1.181149 -1.597982 -2.161519
C  -2.652849 3.204453 -0.596546
C  3.176604 0.749964 0.784007
C  3.819061 0.444254 -0.393423
C  -2.732324 3.483827 -1.958305
C  -2.547491 4.262407 0.300711
C  -2.707367 4.793856 -2.414617
C  -2.524185 5.574989 -0.152186
C  -2.602028 5.844204 -1.511707
H  -1.31953 -3.374322 3.768235
H  -0.477862 -6.16796 2.743172
H  -0.560176 -5.630076 4.477881
H  1.191516 -4.362913 2.247303
H  1.125008 -3.813064 3.980108
H  -2.534739 -4.133281 1.673759
H  -0.986344 -4.546514 0.933189
H  -2.080496 -0.429516 0.827489
H  -3.008421 1.731153 0.923792
H  -3.340803 1.174872 -0.699342
H  3.674096 -0.549097 -2.264239
H  4.827631 0.793588 -0.567931
H  -2.820818 2.669636 -2.667846
H  -2.487133 4.058803 1.363218
H  -2.772084 4.995635 -3.476006
H  -2.445195 6.387687 0.558299
H  -2.583905 6.8666 -1.86614
elementType: F O N C H
totalener: -1531.66001090 hartree
nucrepener: 2869.13686961 hartree
electener: -4400.79688051 hartree
oneelecener: -7809.23338096 hartree
twoeener: 3408.43650045 hartree
cpcmener: -0.04100761 hartree
kineticenergy: 1525.78296823 hartree
xcener: -138.188958227531 hartree
chargesum: -0.0000000
charge: -0.202501 -0.174982 -0.174548 -0.177368 -0.199638 -0.261988 -0.494281 -0.170803 -0.167837 -0.074242 -0.209827 -0.162664 0.038696 0.278736 -0.090083 -0.098420 0.266465 0.358259 -0.038010 -0.090723 0.528141 0.014747 0.198914 -0.167599 -0.210367 -0.201811 -0.158440 -0.159880 -0.163912 0.090200 0.090233 0.096523 0.075988 0.095747 0.102653 0.089853 0.180519 0.125194 0.137479 0.151817 0.160849 0.144302 0.143170 0.160166 0.159995 0.161279
qa: -0.2025 -0.1750 -0.1745 -0.1774 -0.1996 -0.2620 -0.4943 -0.1708 -0.1678 -0.0742 -0.2098 -0.1627 0.0387 0.2787 -0.0901 -0.0984 0.2665 0.3583 -0.0380 -0.0907 0.5281 0.0147 0.1989 -0.1676 -0.2104 -0.2018 -0.1584 -0.1599 -0.1639 0.0902 0.0902 0.0965 0.0760 0.0957 0.1027 0.0899 0.1805 0.1252 0.1375 0.1518 0.1608 0.1443 0.1432 0.1602 0.1600 0.1613
va: 1.1022 1.1284 1.1183 1.1213 1.0967 1.9363 1.9959 2.8715 3.3112 3.7688 3.9419 3.8781 3.8905 3.8984 3.8125 3.7174 3.9059 4.1266 3.7366 3.9029 4.4548 3.5880 4.0178 3.9106 3.9564 3.9559 3.8881 3.8888 3.8864 1.0132 1.0143 1.0156 1.0308 1.0153 1.0013 1.0086 1.0287 1.0086 1.0030 1.0055 0.9938 1.0041 1.0036 0.9902 0.9903 0.9891
dispcorr: -0.021800658 hartree
energy: -1531.681811561566
dipole: -23.42137 22.37698 -1.04440 -0.89856 0.39577 -0.50279 14.92808 -14.14265 0.78543
magnitude: 1.40017 au
magnitude: 3.55894 debye
