program: Orca
programVersion: 5.0.4
elementType: F F F F F O O N N C C C C C C C C C C C C C C C C C C C C H H H H H H H H H H H H H H H H H
charge: 0
multiplicity: 1
keywords: wb97x-d3
keywords: def2-TZVPP
keywords: def2/J RIJCOSX
keywords: DEFGRID2
keywords: scfconv7
keywords: smallprint printgap noloewdin
keywords: NOSOSCF
formula: C20H17F5N2O2
InChI: InChI=1/C20H17F5N2O2/c21-15-9-8-14(20(23,24)25)17(18(15)22)19(27-29-11-13-6-7-13)26-16(28)10-12-4-2-1-3-5-12/h1-5,8-9,13,26H,6-7,10-11H2
46 atoms
F  2.044588 1.217258 2.008452
F  1.15707 -3.13693 -0.999353
F  -0.297613 -1.610036 -1.42302
F  1.245463 -2.050983 -2.846195
F  4.345832 1.888117 0.814658
O  -0.85462 -1.953972 2.377744
O  -0.197891 1.558925 -0.710406
N  0.297424 -1.729913 1.678323
N  -0.750858 0.290079 1.091213
C  -1.081101 -4.306357 1.799473
C  -1.884743 -5.530544 2.115996
C  -2.449816 -4.476146 1.215799
C  -0.873138 -3.288355 2.879169
C  0.283819 -0.622961 1.048557
C  1.524428 -0.299014 0.302686
C  1.89118 -0.902891 -0.900665
C  2.377066 0.632393 0.857872
C  -0.921862 1.349684 0.240676
C  -2.073376 2.252005 0.621874
C  3.090764 -0.566336 -1.510087
C  0.997745 -1.923466 -1.541508
C  -2.489888 3.153056 -0.501362
C  3.566289 0.974948 0.241964
C  3.932336 0.37781 -0.942275
C  -1.802006 4.336598 -0.756009
C  -3.55498 2.804594 -1.3258
C  -2.172848 5.156546 -1.812557
C  -3.929266 3.623009 -2.383374
C  -3.237105 4.80062 -2.630925
H  -0.245212 -4.442143 1.122282
H  -2.29783 -5.621247 3.113276
H  -1.571406 -6.468925 1.677834
H  -3.246645 -3.852453 1.602804
H  -2.52733 -4.691782 0.158081
H  0.047365 -3.483342 3.436427
H  -1.703659 -3.304492 3.586935
H  -1.46605 0.135739 1.789741
H  -1.740402 2.839036 1.484007
H  -2.913949 1.648557 0.970995
H  3.388291 -1.024414 -2.441999
H  4.864551 0.647205 -1.420067
H  -0.974745 4.624031 -0.118024
H  -4.099815 1.887156 -1.136797
H  -1.630113 6.07473 -1.997405
H  -4.762033 3.339625 -3.013881
H  -3.527419 5.440254 -3.454301
elementType: F O N C H
totalener: -1531.66069485 hartree
nucrepener: 2883.90173275 hartree
electener: -4415.56242760 hartree
oneelecener: -7838.73827092 hartree
twoeener: 3423.17584331 hartree
cpcmener: -0.04141044 hartree
kineticenergy: 1525.78918959 hartree
xcener: -138.189577260301 hartree
chargesum: -0.0000000
charge: -0.202630 -0.174709 -0.179005 -0.174851 -0.199597 -0.265138 -0.492041 -0.165311 -0.166728 -0.101904 -0.195793 -0.176766 0.079121 0.259237 -0.087408 -0.102566 0.266875 0.349990 -0.038302 -0.091867 0.538393 0.029888 0.198738 -0.167239 -0.217365 -0.205186 -0.153262 -0.154919 -0.169643 0.090304 0.090415 0.096098 0.086251 0.093777 0.085957 0.096340 0.181525 0.135636 0.120013 0.152719 0.160748 0.143870 0.145045 0.160119 0.160056 0.161121
qa: -0.2026 -0.1747 -0.1790 -0.1749 -0.1996 -0.2651 -0.4920 -0.1653 -0.1667 -0.1019 -0.1958 -0.1768 0.0791 0.2592 -0.0874 -0.1026 0.2669 0.3500 -0.0383 -0.0919 0.5384 0.0299 0.1987 -0.1672 -0.2174 -0.2052 -0.1533 -0.1549 -0.1696 0.0903 0.0904 0.0961 0.0863 0.0938 0.0860 0.0963 0.1815 0.1356 0.1200 0.1527 0.1607 0.1439 0.1450 0.1601 0.1601 0.1611
va: 1.1006 1.1165 1.1184 1.1289 1.0969 1.9335 2.0012 2.9124 3.3083 3.7879 3.9391 3.8980 3.8672 3.9709 3.7928 3.7140 3.9055 4.1407 3.7582 3.9083 4.4324 3.5887 4.0203 3.9121 3.9610 3.9513 3.8812 3.8851 3.8906 1.0198 1.0160 1.0144 1.0189 1.0177 1.0148 0.9964 1.0260 1.0022 1.0107 1.0051 0.9938 1.0050 1.0019 0.9897 0.9901 0.9892
dispcorr: -0.022184941 hartree
energy: -1531.682879794603
dipole: -31.00238 30.19613 -0.80624 -2.11917 1.97193 -0.14723 7.64784 -6.67051 0.97732
magnitude: 1.27549 au
magnitude: 3.24203 debye
