program: Orca
programVersion: 5.0.4
elementType: F F F F F O O N N C C C C C C C C C C C C C C C C C C C C H H H H H H H H H H H H H H H H H
charge: 0
multiplicity: 1
keywords: wb97x-d3
keywords: def2-TZVPP
keywords: def2/J RIJCOSX
keywords: DEFGRID2
keywords: scfconv7
keywords: smallprint printgap noloewdin
keywords: NOSOSCF
formula: C20H17F5N2O2
InChI: InChI=1/C20H17F5N2O2/c21-15-9-8-14(20(23,24)25)17(18(15)22)19(27-29-11-13-6-7-13)26-16(28)10-12-4-2-1-3-5-12/h1-5,8-9,13,26H,6-7,10-11H2
46 atoms
F  2.568342 1.101436 2.112135
F  0.598765 -2.670127 -1.206205
F  -0.052173 -0.694714 -1.749292
F  1.419453 -1.705747 -2.940106
F  5.129507 0.741979 1.382262
O  -1.293455 -0.588595 2.005079
O  1.247611 2.281104 -0.796128
N  -0.049581 -0.900899 1.522512
N  -0.249271 1.208642 0.538856
C  -2.560224 -2.563721 1.352621
C  -1.764965 -3.675406 0.741513
C  -2.916921 -3.990506 1.641883
C  -1.985249 -1.743901 2.466373
C  0.431117 0.04262 0.811289
C  1.809611 -0.168221 0.301594
C  2.113506 -0.903309 -0.844263
C  2.847319 0.372567 1.032233
C  0.139618 2.213241 -0.303532
C  -0.91878 3.270013 -0.537192
C  3.436886 -1.098987 -1.213721
C  1.020752 -1.49305 -1.684618
C  -2.315522 2.722927 -0.642389
C  4.163831 0.188432 0.653935
C  4.466924 -0.554351 -0.464564
C  -2.675409 1.945866 -1.743106
C  -3.25236 2.94277 0.36232
C  -3.946456 1.400783 -1.835496
C  -4.527375 2.396623 0.271528
C  -4.876223 1.623981 -0.826143
H  -3.233812 -2.02567 0.693229
H  -0.766392 -3.852005 1.120456
H  -1.881931 -3.857887 -0.318524
H  -2.69793 -4.375592 2.630694
H  -3.823733 -4.384955 1.202973
H  -1.328376 -2.347972 3.100369
H  -2.780789 -1.343233 3.096733
H  -1.198433 1.243336 0.889842
H  -0.639344 3.808413 -1.442985
H  -0.851212 3.983262 0.289771
H  3.690262 -1.673347 -2.093007
H  5.498873 -0.701078 -0.753186
H  -1.95363 1.766242 -2.531709
H  -2.982665 3.543172 1.222952
H  -4.213068 0.799157 -2.694725
H  -5.246163 2.576243 1.060285
H  -5.868209 1.197546 -0.897957
elementType: F O N C H
totalener: -1531.65899458 hartree
nucrepener: 2974.83706247 hartree
electener: -4506.49605705 hartree
oneelecener: -8020.11676781 hartree
twoeener: 3513.62071076 hartree
cpcmener: -0.03413381 hartree
kineticenergy: 1525.78990244 hartree
xcener: -138.189980381773 hartree
chargesum: 0.0000000
charge: -0.201303 -0.172243 -0.178686 -0.174811 -0.199469 -0.267857 -0.491091 -0.164883 -0.171838 -0.065201 -0.174447 -0.211161 0.049873 0.252690 -0.080089 -0.088065 0.263307 0.365609 -0.048154 -0.106202 0.542448 -0.008930 0.192834 -0.164209 -0.217765 -0.186017 -0.137830 -0.144479 -0.167428 0.088148 0.077462 0.093226 0.090974 0.096295 0.088595 0.104465 0.195998 0.110864 0.121463 0.151933 0.160807 0.144007 0.146533 0.161675 0.161436 0.161516
qa: -0.2013 -0.1722 -0.1787 -0.1748 -0.1995 -0.2679 -0.4911 -0.1649 -0.1718 -0.0652 -0.1744 -0.2112 0.0499 0.2527 -0.0801 -0.0881 0.2633 0.3656 -0.0482 -0.1062 0.5424 -0.0089 0.1928 -0.1642 -0.2178 -0.1860 -0.1378 -0.1445 -0.1674 0.0881 0.0775 0.0932 0.0910 0.0963 0.0886 0.1045 0.1960 0.1109 0.1215 0.1519 0.1608 0.1440 0.1465 0.1617 0.1614 0.1615
va: 1.1031 1.1200 1.1155 1.1307 1.0970 1.9323 2.0068 2.9034 3.2702 3.7626 3.8740 3.9523 3.8613 3.9721 3.7717 3.7146 3.9103 4.0971 3.7841 3.9294 4.4183 3.6283 4.0301 3.9075 3.9444 3.9127 3.8631 3.8728 3.8954 1.0148 1.0299 1.0204 1.0146 1.0161 1.0145 0.9995 1.0218 1.0202 1.0045 1.0051 0.9935 1.0070 1.0031 0.9891 0.9893 0.9890
dispcorr: -0.024851018 hartree
energy: -1531.683845602550
dipole: -37.70011 36.29308 -1.40703 -2.26655 2.15543 -0.11112 6.49991 -6.44003 0.05988
magnitude: 1.41268 au
magnitude: 3.59074 debye
