program: Orca
programVersion: 5.0.4
elementType: F F F F F O O N N C C C C C C C C C C C C C C C C C C C C H H H H H H H H H H H H H H H H H
charge: 0
multiplicity: 1
keywords: wb97x-d3
keywords: def2-TZVPP
keywords: def2/J RIJCOSX
keywords: DEFGRID2
keywords: scfconv7
keywords: smallprint printgap noloewdin
keywords: NOSOSCF
formula: C20H17F5N2O2
InChI: InChI=1/C20H17F5N2O2/c21-15-9-8-14(20(23,24)25)17(18(15)22)19(27-29-11-13-6-7-13)26-16(28)10-12-4-2-1-3-5-12/h1-5,8-9,13,26H,6-7,10-11H2
46 atoms
F  2.504343 0.065546 2.406038
F  1.875152 -0.86301 -3.426491
F  0.340495 -1.312219 -1.999731
F  0.73429 0.728047 -2.549841
F  5.094612 0.163861 1.797321
O  -1.168505 -1.451779 1.474954
O  1.102395 2.423596 0.225112
N  0.146659 -1.448741 1.110761
N  -0.37817 0.711562 0.382854
C  -3.050992 -2.681098 2.155693
C  -3.641623 -3.575441 3.201385
C  -3.552199 -2.101869 3.443807
C  -1.579687 -2.748422 1.903574
C  0.493949 -0.337592 0.591143
C  1.908425 -0.233633 0.156705
C  2.323726 -0.327946 -1.176379
C  2.86931 -0.064728 1.132327
C  -0.042893 2.019333 0.181958
C  -1.211734 2.954637 -0.049799
C  3.672862 -0.256289 -1.48935
C  1.320343 -0.450056 -2.286832
C  -2.45145 2.310446 -0.599745
C  4.213955 0.000215 0.81396
C  4.625053 -0.095765 -0.49435
C  -2.554018 2.0474 -1.964604
C  -3.491622 1.922655 0.241095
C  -3.672271 1.407893 -2.477292
C  -4.610042 1.275929 -0.270129
C  -4.701643 1.016165 -1.629851
H  -3.658532 -2.505023 1.27425
H  -2.971503 -4.223799 3.752311
H  -4.613777 -4.006596 3.002745
H  -2.819065 -1.749046 4.158955
H  -4.464126 -1.519919 3.415753
H  -1.34824 -3.484636 1.128731
H  -1.041305 -3.03112 2.814341
H  -1.36362 0.4819 0.426504
H  -0.854669 3.7435 -0.71311
H  -1.420629 3.429748 0.913701
H  4.009802 -0.327512 -2.513164
H  5.677158 -0.044078 -0.739192
H  -1.75369 2.34936 -2.629501
H  -3.424702 2.124944 1.303647
H  -3.739624 1.211383 -3.539391
H  -5.409286 0.977556 0.395665
H  -5.572261 0.512937 -2.029535
elementType: F O N C H
totalener: -1531.65946738 hartree
nucrepener: 2935.27859633 hartree
electener: -4466.93806371 hartree
oneelecener: -7940.73550956 hartree
twoeener: 3473.79744585 hartree
cpcmener: -0.03510518 hartree
kineticenergy: 1525.77986825 hartree
xcener: -138.188080150355 hartree
chargesum: -0.0000000
charge: -0.198331 -0.172886 -0.176454 -0.174428 -0.198821 -0.250825 -0.496822 -0.167078 -0.158604 -0.094055 -0.202238 -0.173099 0.065438 0.248999 -0.094160 -0.092930 0.250240 0.329257 -0.014056 -0.095950 0.538874 -0.002219 0.199807 -0.162250 -0.225223 -0.203361 -0.136681 -0.150628 -0.161819 0.095944 0.091147 0.098852 0.088933 0.095695 0.086446 0.082890 0.202621 0.112168 0.122884 0.153380 0.161624 0.142660 0.150024 0.161772 0.161276 0.161986
qa: -0.1983 -0.1729 -0.1765 -0.1744 -0.1988 -0.2508 -0.4968 -0.1671 -0.1586 -0.0941 -0.2022 -0.1731 0.0654 0.2490 -0.0942 -0.0929 0.2502 0.3293 -0.0141 -0.0959 0.5389 -0.0022 0.1998 -0.1622 -0.2252 -0.2034 -0.1367 -0.1506 -0.1618 0.0959 0.0911 0.0989 0.0889 0.0957 0.0864 0.0829 0.2026 0.1122 0.1229 0.1534 0.1616 0.1427 0.1500 0.1618 0.1613 0.1620
va: 1.1078 1.1341 1.1262 1.1152 1.0974 1.9600 2.0025 2.9096 3.2541 3.8540 3.9356 3.8808 3.8891 3.9549 3.7804 3.7136 3.9273 4.1236 3.7737 3.9075 4.4328 3.5852 4.0146 3.9068 3.9563 3.9074 3.8751 3.8706 3.8959 1.0112 1.0158 1.0154 1.0168 1.0166 1.0061 0.9973 1.0125 1.0200 1.0035 1.0045 0.9934 1.0108 1.0025 0.9888 0.9899 0.9886
dispcorr: -0.023766859 hartree
energy: -1531.683234234628
dipole: -42.48635 40.98680 -1.49954 -4.57418 4.10534 -0.46884 13.20899 -13.68007 -0.47109
magnitude: 1.64023 au
magnitude: 4.16914 debye
