program: Orca
programVersion: 5.0.4
elementType: F F F F F O O N N C C C C C C C C C C C C C C C C C C C C H H H H H H H H H H H H H H H H H
charge: 0
multiplicity: 1
keywords: wb97x-d3
keywords: def2-TZVPP
keywords: def2/J RIJCOSX
keywords: DEFGRID2
keywords: scfconv7
keywords: smallprint printgap noloewdin
keywords: NOSOSCF
formula: C20H17F5N2O2
InChI: InChI=1/C20H17F5N2O2/c21-15-9-8-14(20(23,24)25)17(18(15)22)19(27-29-11-13-6-7-13)26-16(28)10-12-4-2-1-3-5-12/h1-5,8-9,13,26H,6-7,10-11H2
46 atoms
F  2.553149 1.067144 -2.234517
F  0.856082 -2.655801 1.244151
F  1.660441 -1.621311 2.946103
F  0.110336 -0.709686 1.772044
F  5.141139 0.861054 -1.561752
O  -1.239944 -0.86111 -1.873307
O  1.182737 2.272741 0.742315
N  0.04648 -1.055712 -1.442344
N  -0.240097 1.101166 -0.590764
C  -2.194234 -2.849652 -0.850873
C  -3.321782 -2.372472 0.012243
C  -3.465128 -3.638618 -0.773244
C  -1.882718 -2.109532 -2.11507
C  0.496994 -0.039745 -0.816776
C  1.899489 -0.147867 -0.344753
C  2.267588 -0.81956 0.821707
C  2.889689 0.409601 -1.125968
C  0.085291 2.1388 0.240153
C  -1.028657 3.142054 0.452699
C  3.60659 -0.92353 1.169828
C  1.224684 -1.449845 1.696531
C  -2.410838 2.550056 0.464671
C  4.223169 0.306252 -0.774996
C  4.589608 -0.36063 0.37149
C  -3.324291 2.839763 -0.543448
C  -2.783504 1.6677 1.47923
C  -4.588853 2.262687 -0.539713
C  -4.042978 1.089218 1.483246
C  -4.9499 1.385253 0.47149
H  -1.339404 -3.272505 -0.335245
H  -3.880291 -1.504343 -0.317701
H  -3.205008 -2.443855 1.085856
H  -4.121035 -3.629999 -1.635287
H  -3.441802 -4.580915 -0.241928
H  -2.801157 -1.84577 -2.64214
H  -1.268897 -2.714081 -2.78905
H  -1.192429 1.071615 -0.933706
H  -0.943148 3.888679 -0.342633
H  -0.815956 3.657729 1.389822
H  3.910999 -1.4417 2.067602
H  5.633912 -0.439094 0.641768
H  -3.044415 3.520041 -1.338768
H  -2.080382 1.431508 2.269752
H  -5.289229 2.498577 -1.330218
H  -4.318768 0.404612 2.274845
H  -5.932945 0.932763 0.474159
elementType: F O N C H
totalener: -1531.65949795 hartree
nucrepener: 2987.15319082 hartree
electener: -4518.81268877 hartree
oneelecener: -8044.60072233 hartree
twoeener: 3525.78803356 hartree
cpcmener: -0.03411090 hartree
kineticenergy: 1525.78406115 hartree
xcener: -138.189388362025 hartree
chargesum: -0.0000000
charge: -0.200741 -0.175019 -0.174220 -0.179234 -0.199287 -0.272804 -0.491474 -0.171856 -0.167564 -0.091157 -0.186407 -0.197136 0.077816 0.252878 -0.080350 -0.094860 0.262327 0.367493 -0.045625 -0.102449 0.546494 -0.025388 0.193649 -0.164124 -0.171624 -0.194769 -0.138426 -0.172813 -0.160282 0.090116 0.085978 0.096591 0.091376 0.096089 0.098284 0.088506 0.191908 0.118561 0.111777 0.152959 0.160796 0.144572 0.143056 0.161648 0.162724 0.162008
qa: -0.2007 -0.1750 -0.1742 -0.1792 -0.1993 -0.2728 -0.4915 -0.1719 -0.1676 -0.0912 -0.1864 -0.1971 0.0778 0.2529 -0.0804 -0.0949 0.2623 0.3675 -0.0456 -0.1024 0.5465 -0.0254 0.1936 -0.1641 -0.1716 -0.1948 -0.1384 -0.1728 -0.1603 0.0901 0.0860 0.0966 0.0914 0.0961 0.0983 0.0885 0.1919 0.1186 0.1118 0.1530 0.1608 0.1446 0.1431 0.1616 0.1627 0.1620
va: 1.1039 1.1168 1.1313 1.1160 1.0972 1.9225 2.0065 2.9063 3.2669 3.7692 3.8777 3.9596 3.8526 3.9782 3.7568 3.7188 3.9254 4.0938 3.7901 3.9263 4.4162 3.6499 4.0233 3.9091 3.9174 3.9149 3.8673 3.8303 3.8496 1.0206 1.0193 1.0178 1.0162 1.0148 0.9968 1.0152 1.0271 1.0054 1.0193 1.0047 0.9935 1.0033 1.0081 0.9885 0.9896 0.9889
dispcorr: -0.025970429 hartree
energy: -1531.685468380624
dipole: -41.73327 40.36083 -1.37244 -1.26960 1.12091 -0.14869 -3.69331 3.71996 0.02665
magnitude: 1.38073 au
magnitude: 3.50953 debye
