program: Orca
programVersion: 5.0.4
elementType: F F F F F O O N N C C C C C C C C C C C C C C C C C C C C H H H H H H H H H H H H H H H H H
charge: 0
multiplicity: 1
keywords: wb97x-d3
keywords: def2-TZVPP
keywords: def2/J RIJCOSX
keywords: DEFGRID2
keywords: scfconv7
keywords: smallprint printgap noloewdin
keywords: NOSOSCF
formula: C20H17F5N2O2
InChI: InChI=1/C20H17F5N2O2/c21-15-9-8-14(20(23,24)25)17(18(15)22)19(27-29-11-13-6-7-13)26-16(28)10-12-4-2-1-3-5-12/h1-5,8-9,13,26H,6-7,10-11H2
46 atoms
F  1.09789 1.339931 -1.971407
F  1.461529 -1.293651 2.296399
F  1.948775 -2.972385 1.0414
F  3.466527 -2.065126 2.252312
F  3.649705 1.800975 -2.605986
O  -1.514819 -1.695658 -0.276408
O  1.073025 1.853428 1.423496
N  -0.177997 -1.554524 -0.509062
N  -0.521145 0.531886 0.491268
C  -3.45189 -3.009128 -0.50774
C  -4.071607 -4.35217 -0.273172
C  -3.918443 -3.391694 0.8635
C  -1.985743 -2.942088 -0.786516
C  0.271814 -0.442648 -0.076785
C  1.714228 -0.197017 -0.314444
C  2.738225 -0.850642 0.37415
C  2.057359 0.693914 -1.309841
C  -0.09611 1.63621 1.17501
C  -1.211404 2.547192 1.641179
C  4.063329 -0.61093 0.043337
C  2.404756 -1.797511 1.48896
C  -2.309346 2.743586 0.631541
C  3.379404 0.934397 -1.63395
C  4.38971 0.28265 -0.965394
C  -2.099631 3.567326 -0.473014
C  -3.53235 2.092617 0.762947
C  -3.093643 3.737747 -1.424504
C  -4.528058 2.25847 -0.192095
C  -4.310931 3.081164 -1.287442
H  -4.055993 -2.28598 -1.045432
H  -3.42437 -5.220295 -0.296364
H  -5.062518 -4.525842 -0.671115
H  -3.166002 -3.606737 1.612462
H  -4.805944 -2.906988 1.248657
H  -1.78545 -3.002533 -1.860248
H  -1.460631 -3.76785 -0.295754
H  -1.519797 0.401164 0.388744
H  -0.756147 3.499931 1.9108
H  -1.617052 2.115085 2.560852
H  4.86629 -1.108951 0.566683
H  5.42252 0.472214 -1.224228
H  -1.152248 4.081375 -0.585995
H  -3.708331 1.451137 1.618493
H  -2.919264 4.384707 -2.274451
H  -5.473906 1.745567 -0.076431
H  -5.086619 3.214564 -2.030133
elementType: F O N C H
totalener: -1531.66018534 hartree
nucrepener: 2907.09711077 hartree
electener: -4438.75729611 hartree
oneelecener: -7884.54316338 hartree
twoeener: 3445.78586727 hartree
cpcmener: -0.03546030 hartree
kineticenergy: 1525.79268700 hartree
xcener: -138.190165165765 hartree
chargesum: -0.0000000
charge: -0.202323 -0.177888 -0.172195 -0.175138 -0.199043 -0.250981 -0.490124 -0.166848 -0.171762 -0.093678 -0.203229 -0.172373 0.060697 0.261427 -0.090517 -0.120319 0.262566 0.359119 -0.056041 -0.077155 0.533239 -0.004223 0.206020 -0.170062 -0.209701 -0.199367 -0.139943 -0.144349 -0.167855 0.097242 0.091237 0.098674 0.088186 0.096299 0.088021 0.082167 0.201243 0.108977 0.126020 0.152127 0.160450 0.145467 0.151657 0.161291 0.161333 0.161655
qa: -0.2023 -0.1779 -0.1722 -0.1751 -0.1990 -0.2510 -0.4901 -0.1668 -0.1718 -0.0937 -0.2032 -0.1724 0.0607 0.2614 -0.0905 -0.1203 0.2626 0.3591 -0.0560 -0.0772 0.5332 -0.0042 0.2060 -0.1701 -0.2097 -0.1994 -0.1399 -0.1443 -0.1679 0.0972 0.0912 0.0987 0.0882 0.0963 0.0880 0.0822 0.2012 0.1090 0.1260 0.1521 0.1605 0.1455 0.1517 0.1613 0.1613 0.1617
va: 1.1002 1.1200 1.1222 1.1284 1.0976 1.9552 2.0080 2.9094 3.2738 3.8530 3.9348 3.8812 3.8915 3.9168 3.8264 3.7483 3.8881 4.1129 3.7857 3.8761 4.4533 3.6014 4.0228 3.9180 3.9419 3.9010 3.8692 3.8784 3.8952 1.0109 1.0152 1.0154 1.0172 1.0160 1.0049 0.9987 1.0107 1.0207 1.0028 1.0047 0.9940 1.0027 1.0011 0.9888 0.9892 0.9888
dispcorr: -0.022738231 hartree
energy: -1531.682923573811
dipole: -44.40979 42.98365 -1.42614 -1.63803 1.53882 -0.09921 -1.61374 1.25331 -0.36043
magnitude: 1.47432 au
magnitude: 3.74743 debye
