program: Orca
programVersion: 5.0.4
elementType: F F F F F O O N N C C C C C C C C C C C C C C C C C C C C H H H H H H H H H H H H H H H H H
charge: 0
multiplicity: 1
keywords: wb97x-d3
keywords: def2-TZVPP
keywords: def2/J RIJCOSX
keywords: DEFGRID2
keywords: scfconv7
keywords: smallprint printgap noloewdin
keywords: NOSOSCF
formula: C20H17F5N2O2
InChI: InChI=1/C20H17F5N2O2/c21-15-9-8-14(20(23,24)25)17(18(15)22)19(27-29-11-13-6-7-13)26-16(28)10-12-4-2-1-3-5-12/h1-5,8-9,13,26H,6-7,10-11H2
46 atoms
F  1.983553 1.368686 1.749585
F  2.633176 -2.146159 -2.957573
F  1.611635 -3.014948 -1.283175
F  0.758238 -1.32483 -2.303936
F  4.639439 1.615819 1.567883
O  -1.250398 -1.286485 1.154185
O  1.03184 2.004894 -1.36539
N  0.093251 -1.326794 0.908491
N  -0.376871 0.697351 -0.151787
C  -3.139623 -2.325675 2.087467
C  -4.217113 -2.196109 1.053005
C  -4.127639 -3.434167 1.8879
C  -1.727435 -2.536327 1.647052
C  0.479745 -0.303914 0.251326
C  1.939197 -0.196796 0.01441
C  2.640418 -0.921819 -0.949086
C  2.644125 0.651658 0.84207
C  -0.082484 1.771406 -0.939264
C  -1.259087 2.659259 -1.290496
C  4.018215 -0.788562 -1.049698
C  1.912137 -1.852212 -1.873557
C  -2.510325 2.464115 -0.483399
C  4.014783 0.783401 0.739789
C  4.711588 0.062348 -0.20319
C  -3.497569 1.57631 -0.905762
C  -2.689356 3.145996 0.718655
C  -4.640503 1.373608 -0.143613
C  -3.832847 2.948544 1.479204
C  -4.811314 2.061032 1.049893
H  -3.257404 -1.731216 2.987155
H  -3.930613 -2.262172 0.01022
H  -5.022993 -1.501104 1.25057
H  -3.779651 -4.343333 1.41316
H  -4.87127 -3.590419 2.658039
H  -1.675634 -3.292135 0.856278
H  -1.100691 -2.870296 2.478641
H  -1.339054 0.588011 0.141694
H  -1.460107 2.48192 -2.351087
H  -0.905704 3.68887 -1.213879
H  4.577598 -1.3445 -1.787626
H  5.785379 0.165655 -0.280872
H  -3.370742 1.040688 -1.839097
H  -1.928522 3.838394 1.059176
H  -5.399604 0.682547 -0.486222
H  -3.960919 3.489274 2.407962
H  -5.703182 1.907439 1.643469
elementType: F O N C H
totalener: -1531.66043592 hartree
nucrepener: 2925.07767574 hartree
electener: -4456.73811166 hartree
oneelecener: -7920.41662285 hartree
twoeener: 3463.67851119 hartree
cpcmener: -0.03458351 hartree
kineticenergy: 1525.79240245 hartree
xcener: -138.191716308295 hartree
chargesum: 0.0000000
charge: -0.201956 -0.174666 -0.174264 -0.177707 -0.199288 -0.248805 -0.506094 -0.173041 -0.171794 -0.076332 -0.188272 -0.205608 0.057709 0.275970 -0.092792 -0.106050 0.249674 0.365935 -0.022940 -0.081529 0.531111 -0.033657 0.202741 -0.169819 -0.180663 -0.194254 -0.189558 -0.144289 -0.143457 0.097181 0.091437 0.093771 0.092800 0.098473 0.084139 0.089334 0.196200 0.120533 0.114486 0.151956 0.160838 0.148491 0.144943 0.165535 0.161349 0.162229
qa: -0.2020 -0.1747 -0.1743 -0.1777 -0.1993 -0.2488 -0.5061 -0.1730 -0.1718 -0.0763 -0.1883 -0.2056 0.0577 0.2760 -0.0928 -0.1060 0.2497 0.3659 -0.0229 -0.0815 0.5311 -0.0337 0.2027 -0.1698 -0.1807 -0.1943 -0.1896 -0.1443 -0.1435 0.0972 0.0914 0.0938 0.0928 0.0985 0.0841 0.0893 0.1962 0.1205 0.1145 0.1520 0.1608 0.1485 0.1449 0.1655 0.1613 0.1622
va: 1.1021 1.1297 1.1199 1.1206 1.0977 1.9546 1.9940 2.9155 3.2826 3.8447 3.8714 3.9570 3.8858 3.9066 3.8119 3.7398 3.8971 4.1078 3.8001 3.8898 4.4592 3.6112 4.0259 3.9164 3.9033 3.9561 3.8701 3.8819 3.8702 1.0104 1.0167 1.0166 1.0157 1.0162 0.9987 1.0069 1.0252 1.0081 1.0161 1.0048 0.9938 1.0027 1.0030 0.9869 0.9891 0.9888
dispcorr: -0.024111297 hartree
energy: -1531.684547215609
dipole: -45.96271 44.54199 -1.42072 0.59590 -0.77649 -0.18059 11.32597 -11.02185 0.30412
magnitude: 1.46408 au
magnitude: 3.72140 debye
