program: Gaussian 09
title: 000064131
version: EM64L-G09RevD.01
frameworkgroup: C1[X(C8H9ClN4O3)]
method: RPBEPBE
basis: SDD
operation: Freq
keyword: #p
keyword: freq=noraman
keyword: PBEPBE/SDD
title: #p freq=noraman PBEPBE/SDD
converged: YES YES NO NO
title: Mulliken charges:
elementType: Cl O O O N N N N C C C C C C C C H H H H H H H H H
charge: 0.053200 -0.335510 -0.253922 -0.422579 -0.135290 -0.153842 -0.221236 -0.001187 0.163159 0.117423 0.229249 0.211561 -0.174459 -0.295443 -0.609535 -0.599070 0.239032 0.233051 0.273327 0.253206 0.252373 0.272295 0.256627 0.255355 0.392215
chargesum: 0.00000
title: Mulliken charges with hydrogens summed into heavy atoms:
elementType: Cl O O O N N N N C C C C C C C C
charge: 0.053200 -0.335510 -0.253922 -0.030364 -0.135290 -0.153842 -0.221236 -0.001187 0.163159 0.117423 0.229249 0.211561 -0.174459 0.176640 0.169371 0.185206
polarizability: 1.91183720e+02 -3.31731067e+00 1.50182636e+02 -1.28563487e+00 -2.37487454e+00 6.68809952e+01
1716.lowfreq: -8.2752 -7.2686 -2.7513 -0.0013 -0.0013 -0.0012 66.7589 70.4797 79.6849
frequency: 66.7481 70.4443 79.6762 102.0710 106.3446 124.5607 141.9242 175.6926 197.1991 218.6674 226.4751 283.1452 303.6457 319.0420 342.0208 367.1376 388.8216 402.4601 470.7500 493.9456 499.4993 571.1455 623.2387 656.7204 667.5671 702.8043 734.1933 748.8450 774.0134 814.3885 932.8252 953.8882 1010.4137 1029.8228 1043.8011 1048.7415 1129.9432 1132.2206 1155.6598 1197.8518 1217.5762 1231.8264 1258.5436 1296.5988 1329.6531 1345.3071 1359.4232 1406.0114 1422.6681 1428.6222 1436.0813 1467.0696 1470.0948 1472.7719 1477.4141 1478.6270 1499.2203 1573.0020 1617.4131 1638.0476 2984.3251 3012.0048 3017.4714 3103.9201 3110.6720 3113.1428 3143.5250 3146.1469 3198.1518
redmass: 5.1452 1.1185 4.1363 4.6148 1.1452 4.4782 4.3079 6.5641 6.3026 9.5481 3.1181 3.2906 7.0317 6.0090 5.9912 5.5073 7.6409 8.0177 7.2617 9.6488 9.1187 5.6158 10.1938 9.0154 11.6197 11.0095 8.1560 7.4693 4.9659 1.1661 3.2138 7.2535 2.1570 6.2190 2.3389 3.0908 1.3013 1.3056 4.9722 3.6696 2.0461 1.8702 5.1878 5.7467 4.8385 2.3932 4.4462 1.6501 1.3203 1.4317 1.1854 1.3470 1.1749 1.0441 1.0478 1.0740 2.1883 8.2774 10.9441 9.2516 1.0673 1.0334 1.0329 1.1027 1.1023 1.0972 1.1016 1.1027 1.0685
irintensity: 0.5686 0.2580 1.2391 1.9383 0.5292 7.9694 3.8929 5.1867 5.6988 2.9110 4.6657 2.3696 0.0314 0.4901 10.9025 7.3006 0.9166 30.8411 27.0088 5.3835 7.6148 3.1942 5.8493 9.7582 0.3758 6.9197 11.5330 16.9159 9.2879 354.7870 10.9135 26.7846 22.8029 155.0153 3.2591 19.7530 0.4317 0.1038 51.2334 28.2459 53.9511 53.0001 39.1026 20.2822 336.4665 30.4993 41.1037 58.5642 58.2414 156.4962 67.7955 28.7810 11.7762 21.3975 11.7089 6.1885 136.7821 24.4381 630.7457 373.3238 51.1412 27.2935 21.1839 14.1034 13.5530 22.1840 0.3139 0.5781 256.3276
temp: 298.150 k
press: 1.00000 atm
elementType: 17 8 8 8 7 7 7 7 6 6 6 6 6 6 6 6 1 1 1 1 1 1 1 1 1
symmnumber: 1
zpe: 469915.2 jmol-1
zpe.correction: 0.178981 hartree
zpe.thermalcorrener: 0.193995 hartree
zpe.thermalcorrenthalpy: 0.194939 hartree
zpe.thermalcorrgfe: 0.136495 hartree
zpe.sumelectzpe: -1213.834245 hartree
zpe.sumelectthermal: -1213.819232 hartree
zpe.sumelectthermalent: -1213.818288 hartree
zpe.sumelectthermalfe: -1213.876732 hartree
dipole: 0.2667 -0.9184 -1.5969
dipole: 1.8614
quadrupole: -103.8726 -105.6028 -99.2462
quadrupole: -3.0280 -4.3691 -4.2074
quadrupole: -0.9654 -2.6956 3.6610 -3.0280 -4.3691 -4.2074
hfenergy: -1214.0132265 hartree
pointgroup: C01 [X(C8H9Cl1N4O3)]
dipole: -0.0112035 0.350264 -0.6430216 debye
dipolederiv: -0.6911743 0.2836113 -0.0485303 0.1958711 -0.1535991 0.0104983 -0.0589286 0.0214443 0.0025438 -0.8174691 -0.2944275 -0.0052652 -0.2753642 -1.3815189 0.0028562 0.0455764 0.0074312 -0.3595941 -1.4495679 -0.1116306 -0.0717929 -0.1550763 -0.5015206 -0.0102717 -0.0758143 -0.0122301 -0.3627008 -0.6264079 -0.1448123 -0.1650474 -0.1356457 -0.7521107 0.0778557 -0.0159831 0.1871466 -0.5498384 -0.5973699 -0.4001313 -0.0350625 -0.328147 -0.819965 0.0346151 -0.0599704 -0.0010338 -0.1202456 -1.2302633 -0.2961126 -0.0830785 0.3371235 -0.6765549 0.0138376 -0.0745891 -0.0367328 -0.1630412 -1.1882776 -0.2379481 -0.0595148 -0.4462042 -0.7988884 -0.028797 -0.0726359 -0.0118718 -0.2057181 -1.2284564 -0.0713036 -0.0829756 -0.0198463 -0.3901833 0.0006195 -0.0876775 -0.0132871 -0.1986767 -0.0499878 0.4813412 0.0083892 0.3064628 -0.9403515 0.0066455 -0.0185012 -0.0212913 -0.0479186 1.1931583 0.3445181 0.0869134 -0.2049906 0.3866006 -0.0092303 0.0793998 0.0356525 0.1093489 1.44222 -0.0248047 0.0716514 0.2011673 1.7040767 -0.0177043 0.093919 -0.0244936 0.2518864 1.9102527 0.1018678 0.105805 0.0350057 1.0579825 0.0101134 0.0900034 0.0233547 0.2702776 1.453233 -0.2729632 0.1141702 0.1048726 0.7906805 0.0223637 0.1357689 0.0151317 0.0243136 0.567453 0.3235856 0.0707867 0.3755681 0.9963387 -0.133183 0.0560284 -0.1190938 0.6226678 0.0673847 0.1789838 -0.0029887 0.1393758 0.485348 0.0213589 0.001617 0.0252468 0.1979165 0.2030238 -0.1560417 -0.0015923 -0.2463742 0.2460753 -0.013558 0.0054168 -0.0086271 0.1894061 -0.0294414 0.022884 -0.0232341 0.0842156 0.0552363 0.0205986 0.0075436 -0.0175804 0.0886464 0.0626445 -0.0090209 0.0758905 -0.0656766 -0.0450118 -0.0257008 -0.0141012 -0.019441 -0.1592566 -0.0123312 -0.0717324 -0.0083303 0.0559399 0.151986 0.0023481 -0.0061569 -0.0052714 0.1326491 0.1036636 0.0479683 0.0900971 -0.0141936 -0.0092389 -0.0379199 0.0518185 -0.0802339 -0.0335242 0.1177662 0.0474071 -0.0720474 -0.0141388 -0.0144203 0.0383303 -0.0379125 0.0858171 -0.0350844 0.1430399 -0.128353 -0.0023644 -0.0047639 0.0199329 -0.0011781 -0.0004016 -0.0077371 0.1283986 0.0235139 0.0602903 -0.0661815 0.0121128 0.0881653 -0.050242 -0.0774013 0.0085757 -0.0410827 -0.0006686 0.06073 0.075829 0.0055975 0.0892569 0.0512631 0.0837896 0.000429 -0.0198108 0.6340618 0.2660944 0.0284736 0.0571086 0.4116834 0.0144809 -0.0508076 -0.0313044 0.278437 unknown
polarizability: 188.462238|-9.6928385|152.4279697|8.1812196|-1.5245556|67.3571437 unknown
InChI: InChI=1S/C8H9ClN4O3/c1-11-5-4(6(15)12(2)8(11)16)13(3-14)7(9)10-5/h14H,3H2,1-2H3
charge 0 multiplicity 1
25 atoms
Cl -3.794951 1.847715 -0.314873
O  0.008649 -2.624458 -0.037211
O  3.524768 0.502016 0.195567
O  -2.601235 -2.288663 0.653817
N  -1.877685 -0.147364 -0.233523
N  1.342411 1.358026 0.066679
N  1.755905 -1.029745 0.049466
N  -1.044855 1.990502 -0.097301
C  -0.475808 -0.250633 -0.128512
C  -0.005157 1.070434 -0.050687
C  0.382606 -1.397561 -0.043184
C  2.283819 0.29928 0.106391
C  -2.142671 1.211033 -0.202529
C  -2.808795 -1.321021 -0.369988
C  1.80969 2.757488 0.149668
C  2.767079 -2.112581 0.122015
H  -3.833008 -0.93196 -0.272214
H  -2.646712 -1.735781 -1.385475
H  2.907536 2.739115 0.2030
H  1.392583 3.241844 1.04811
H  1.478913 3.317117 -0.740564
H  2.229308 -3.070271 0.081515
H  3.3393 -2.029335 1.059925
H  3.4703 -2.025087 -0.721763
H  -1.703889 -2.726611 0.489772
