program: Orca
programVersion: 5.0.4
elementType: F F F F F O O N N C C C C C C C C C C C C C C C C C C C C H H H H H H H H H H H H H H H H H
charge: 0
multiplicity: 1
keywords: wb97x-d3
keywords: def2-TZVPP
keywords: def2/J RIJCOSX
keywords: DEFGRID2
keywords: scfconv7
keywords: smallprint printgap noloewdin
keywords: NOSOSCF
formula: C20H17F5N2O2
InChI: InChI=1/C20H17F5N2O2/c21-15-9-8-14(20(23,24)25)17(18(15)22)19(27-29-11-13-6-7-13)26-16(28)10-12-4-2-1-3-5-12/h1-5,8-9,13,26H,6-7,10-11H2
46 atoms
F  1.747874 1.328851 1.782023
F  2.896113 -2.133788 -2.880229
F  1.596092 -2.918968 -1.366465
F  0.99499 -1.199921 -2.51021
F  4.40534 1.641745 1.820813
O  -1.331268 -1.418294 0.927376
O  0.97368 1.908539 -1.52741
N  0.027693 -1.383694 0.797387
N  -0.453571 0.590956 -0.347642
C  -3.223239 -2.444943 1.867142
C  -4.144137 -2.805423 0.741678
C  -4.03842 -3.699494 1.936236
C  -1.747643 -2.563088 1.669098
C  0.414427 -0.361211 0.139859
C  1.883096 -0.194466 0.013276
C  2.679881 -0.876866 -0.906822
C  2.495793 0.652916 0.911666
C  -0.152612 1.65404 -1.148588
C  -1.347657 2.477272 -1.583914
C  4.055915 -0.704484 -0.897549
C  2.044565 -1.785011 -1.915487
C  -2.51024 2.483483 -0.631635
C  3.868133 0.820116 0.922843
C  4.656242 0.142566 0.021593
C  -3.557048 1.574049 -0.76835
C  -2.536792 3.385049 0.430288
C  -4.605531 1.560408 0.142928
C  -3.587402 3.379117 1.33532
C  -4.623878 2.464519 1.195149
H  -3.5376 -1.63083 2.511543
H  -3.699572 -3.144007 -0.186236
H  -5.04417 -2.21729 0.617266
H  -3.523761 -4.645287 1.820011
H  -4.863182 -3.724889 2.635891
H  -1.501253 -3.476625 1.118162
H  -1.223498 -2.592873 2.628481
H  -1.425525 0.461528 -0.095693
H  -1.654144 2.077438 -2.55583
H  -0.987127 3.490328 -1.763024
H  4.686611 -1.224247 -1.603766
H  5.72971 0.274287 0.031768
H  -3.551498 0.870384 -1.592843
H  -1.728528 4.097244 0.547004
H  -5.409735 0.8455 0.025815
H  -3.597193 4.08922 2.151998
H  -5.442943 2.459584 1.902349
elementType: F O N C H
totalener: -1531.66023904 hartree
nucrepener: 2914.74673523 hartree
electener: -4446.40697426 hartree
oneelecener: -7899.77496715 hartree
twoeener: 3453.36799289 hartree
cpcmener: -0.03470040 hartree
kineticenergy: 1525.79612128 hartree
xcener: -138.191629774820 hartree
chargesum: -0.0000000
charge: -0.201490 -0.173908 -0.173005 -0.177411 -0.199452 -0.246920 -0.499438 -0.173095 -0.173739 -0.091941 -0.176016 -0.200838 0.057676 0.266820 -0.094389 -0.112665 0.250863 0.367909 -0.044254 -0.078420 0.533047 -0.014936 0.202220 -0.167503 -0.197836 -0.193567 -0.164675 -0.145579 -0.155176 0.096941 0.088777 0.095466 0.091039 0.098328 0.083349 0.088493 0.201366 0.124408 0.109416 0.153087 0.161157 0.154058 0.145693 0.162390 0.161727 0.162025
qa: -0.2015 -0.1739 -0.1730 -0.1774 -0.1995 -0.2469 -0.4994 -0.1731 -0.1737 -0.0919 -0.1760 -0.2008 0.0577 0.2668 -0.0944 -0.1127 0.2509 0.3679 -0.0443 -0.0784 0.5330 -0.0149 0.2022 -0.1675 -0.1978 -0.1936 -0.1647 -0.1456 -0.1552 0.0969 0.0888 0.0955 0.0910 0.0983 0.0833 0.0885 0.2014 0.1244 0.1094 0.1531 0.1612 0.1541 0.1457 0.1624 0.1617 0.1620
va: 1.1030 1.1308 1.1239 1.1194 1.0972 1.9576 1.9997 2.9138 3.2806 3.8504 3.8782 3.9403 3.8888 3.9071 3.8286 3.7383 3.9153 4.1031 3.8169 3.8774 4.4583 3.6078 4.0204 3.9128 3.8859 3.9539 3.8689 3.8825 3.8866 1.0111 1.0177 1.0178 1.0163 1.0159 0.9984 1.0062 1.0192 1.0027 1.0192 1.0044 0.9937 1.0011 1.0018 0.9898 0.9889 0.9888
dispcorr: -0.023409114 hartree
energy: -1531.683648149148
dipole: -45.41725 44.02878 -1.38847 -0.48856 0.32442 -0.16414 10.96665 -10.53758 0.42907
magnitude: 1.46250 au
magnitude: 3.71737 debye
