program: Orca
programVersion: 5.0.4
elementType: F F F F F O O N N C C C C C C C C C C C C C C C C C C C C H H H H H H H H H H H H H H H H H
charge: 0
multiplicity: 1
keywords: wb97x-d3
keywords: def2-TZVPP
keywords: def2/J RIJCOSX
keywords: DEFGRID2
keywords: scfconv7
keywords: smallprint printgap noloewdin
keywords: NOSOSCF
formula: C20H17F5N2O2
InChI: InChI=1/C20H17F5N2O2/c21-15-9-8-14(20(23,24)25)17(18(15)22)19(27-29-11-13-6-7-13)26-16(28)10-12-4-2-1-3-5-12/h1-5,8-9,13,26H,6-7,10-11H2
46 atoms
F  2.615047 1.149054 2.055806
F  -0.062824 -0.915659 -1.642818
F  1.433766 -1.739068 -2.939576
F  0.843741 -2.815453 -1.180636
F  5.16132 0.928767 1.241976
O  -1.126818 -0.708508 2.15514
O  1.134015 2.247376 -0.797856
N  0.073911 -1.005711 1.552173
N  -0.206912 1.139035 0.669821
C  -2.841186 -2.050937 1.093158
C  -2.378834 -2.881177 -0.064098
C  -3.440603 -3.4026 0.852693
C  -1.963592 -1.853653 2.291793
C  0.501252 -0.02595 0.854485
C  1.862947 -0.175402 0.281527
C  2.167732 -0.903038 -0.868186
C  2.895378 0.429899 0.969572
C  0.078128 2.151024 -0.207214
C  -1.038189 3.16382 -0.351726
C  3.486957 -1.024576 -1.283231
C  1.093676 -1.589292 -1.657829
C  -2.398878 2.525569 -0.426934
C  4.205699 0.317689 0.547342
C  4.510728 -0.41491 -0.577522
C  -3.313586 2.652908 0.613428
C  -2.734412 1.740413 -1.529642
C  -4.541379 2.003384 0.557993
C  -3.958868 1.093401 -1.587305
C  -4.86512 1.220502 -0.540342
H  -3.475147 -1.201255 0.856193
H  -1.400257 -3.337274 0.000917
H  -2.664043 -2.567234 -1.060223
H  -3.171418 -4.204893 1.52961
H  -4.46077 -3.447163 0.494272
H  -1.356814 -2.742098 2.49144
H  -2.567721 -1.654419 3.178999
H  -1.123992 1.146723 1.099098
H  -0.827286 3.753256 -1.24398
H  -0.982584 3.844258 0.503186
H  3.740182 -1.591595 -2.167425
H  5.537863 -0.506328 -0.90336
H  -3.062126 3.258974 1.475731
H  -2.02889 1.632012 -2.345637
H  -5.242642 2.110332 1.37526
H  -4.206336 0.485329 -2.447749
H  -5.81973 0.712724 -0.584026
elementType: F O N C H
totalener: -1531.65734789 hartree
nucrepener: 3004.20398943 hartree
electener: -4535.86133731 hartree
oneelecener: -8078.61924381 hartree
twoeener: 3542.75790650 hartree
cpcmener: -0.03419373 hartree
kineticenergy: 1525.77816123 hartree
xcener: -138.187074485370 hartree
chargesum: -0.0000000
charge: -0.201349 -0.180764 -0.174474 -0.179019 -0.198960 -0.279662 -0.486365 -0.168261 -0.172099 -0.081320 -0.187385 -0.208068 0.084217 0.257587 -0.079814 -0.086979 0.252186 0.367088 -0.052319 -0.101886 0.550803 -0.005079 0.199612 -0.168088 -0.195123 -0.208780 -0.128189 -0.143457 -0.174471 0.078343 0.085320 0.096328 0.092479 0.097096 0.086912 0.101243 0.193216 0.108829 0.123232 0.151188 0.160899 0.147818 0.144693 0.161384 0.161121 0.160319
qa: -0.2013 -0.1808 -0.1745 -0.1790 -0.1990 -0.2797 -0.4864 -0.1683 -0.1721 -0.0813 -0.1874 -0.2081 0.0842 0.2576 -0.0798 -0.0870 0.2522 0.3671 -0.0523 -0.1019 0.5508 -0.0051 0.1996 -0.1681 -0.1951 -0.2088 -0.1282 -0.1435 -0.1745 0.0783 0.0853 0.0963 0.0925 0.0971 0.0869 0.1012 0.1932 0.1088 0.1232 0.1512 0.1609 0.1478 0.1447 0.1614 0.1611 0.1603
va: 1.1027 1.1131 1.1315 1.1125 1.0980 1.9210 2.0109 2.8934 3.2679 3.7728 3.8656 3.9586 3.8380 3.9561 3.7600 3.7158 3.9149 4.0931 3.7853 3.9359 4.4150 3.6260 4.0296 3.9174 3.9134 3.9279 3.8397 3.8326 3.8611 1.0196 1.0320 1.0187 1.0157 1.0159 1.0182 0.9984 1.0280 1.0213 1.0049 1.0059 0.9935 1.0026 1.0062 0.9886 0.9895 0.9903
dispcorr: -0.026793568 hartree
energy: -1531.684141453578
dipole: -40.39061 38.94521 -1.44540 -0.69537 0.68570 -0.00966 4.54302 -4.56947 -0.02646
magnitude: 1.44567 au
magnitude: 3.67461 debye
