program: Orca
programVersion: 5.0.4
elementType: F F F F F O O N N C C C C C C C C C C C C C C C C C C C C H H H H H H H H H H H H H H H H H
charge: 0
multiplicity: 1
keywords: wb97x-d3
keywords: def2-TZVPP
keywords: def2/J RIJCOSX
keywords: DEFGRID2
keywords: scfconv7
keywords: smallprint printgap noloewdin
keywords: NOSOSCF
formula: C20H17F5N2O2
InChI: InChI=1/C20H17F5N2O2/c21-15-9-8-14(20(23,24)25)17(18(15)22)19(27-29-11-13-6-7-13)26-16(28)10-12-4-2-1-3-5-12/h1-5,8-9,13,26H,6-7,10-11H2
46 atoms
F  2.627949 0.563921 2.266888
F  0.022029 -0.2240 -1.965809
F  1.522042 -0.834663 -3.373092
F  0.814178 -2.223198 -1.89639
F  5.151159 0.768773 1.413164
O  -1.042963 -1.444955 1.720003
O  1.021409 2.436236 -0.069662
N  0.202798 -1.453133 1.155008
N  -0.262689 0.817257 0.885674
C  -2.811716 -2.647112 2.692956
C  -4.027608 -2.359998 1.864938
C  -3.831219 -3.719168 2.459121
C  -1.483711 -2.767103 2.016884
C  0.544177 -0.290396 0.756089
C  1.9021 -0.174143 0.169742
C  2.217522 -0.486196 -1.153114
C  2.915148 0.242346 1.007094
C  -0.041341 2.074973 0.391318
C  -1.266265 2.960216 0.463529
C  3.529399 -0.389449 -1.59523
C  1.145775 -0.94174 -2.098017
C  -2.37407 2.382808 -0.380377
C  4.218484 0.348594 0.5625
C  4.535414 0.028976 -0.738039
C  -2.28196 2.428363 -1.769909
C  -3.463997 1.745006 0.203402
C  -3.264378 1.850222 -2.559763
C  -4.44733 1.162675 -0.586398
C  -4.349167 1.213208 -1.969543
H  -2.785065 -2.213865 3.687159
H  -3.898302 -2.24693 0.795259
H  -4.789232 -1.720165 2.291426
H  -3.566123 -4.53202 1.794261
H  -4.45582 -4.012433 3.292459
H  -1.572059 -3.34844 1.093263
H  -0.755614 -3.264608 2.664203
H  -1.181932 0.6321 1.266922
H  -0.986691 3.954818 0.118813
H  -1.586675 3.044528 1.504864
H  3.791115 -0.633059 -2.614601
H  5.557393 0.10875 -1.082869
H  -1.435759 2.920091 -2.235254
H  -3.54556 1.702193 1.283399
H  -3.181659 1.89444 -3.63792
H  -5.289916 0.669889 -0.118762
H  -5.114726 0.760718 -2.586146
elementType: F O N C H
totalener: -1531.65999812 hartree
nucrepener: 2948.55364081 hartree
electener: -4480.21363893 hartree
oneelecener: -7967.49465972 hartree
twoeener: 3487.28102079 hartree
cpcmener: -0.03622991 hartree
kineticenergy: 1525.78853990 hartree
xcener: -138.188560759046 hartree
chargesum: -0.0000000
charge: -0.200859 -0.175447 -0.174099 -0.174273 -0.199411 -0.254901 -0.481661 -0.174337 -0.164752 -0.087168 -0.182298 -0.201825 0.059194 0.272459 -0.102066 -0.088453 0.266061 0.347106 -0.057005 -0.096954 0.533456 0.033415 0.192806 -0.161436 -0.237716 -0.203393 -0.132309 -0.149719 -0.172799 0.096724 0.088434 0.098643 0.091459 0.098225 0.083370 0.089054 0.188751 0.105705 0.130028 0.152159 0.161464 0.145065 0.152879 0.161836 0.162227 0.162362
qa: -0.2009 -0.1754 -0.1741 -0.1743 -0.1994 -0.2549 -0.4817 -0.1743 -0.1648 -0.0872 -0.1823 -0.2018 0.0592 0.2725 -0.1021 -0.0885 0.2661 0.3471 -0.0570 -0.0970 0.5335 0.0334 0.1928 -0.1614 -0.2377 -0.2034 -0.1323 -0.1497 -0.1728 0.0967 0.0884 0.0986 0.0915 0.0982 0.0834 0.0891 0.1888 0.1057 0.1300 0.1522 0.1615 0.1451 0.1529 0.1618 0.1622 0.1624
va: 1.1041 1.1196 1.1309 1.1205 1.0973 1.9463 2.0088 2.9053 3.2651 3.8490 3.8739 3.9430 3.8846 3.9283 3.8119 3.7183 3.8978 4.0935 3.7755 3.9076 4.4422 3.5567 4.0300 3.9061 3.9170 3.9136 3.8755 3.8689 3.9037 1.0112 1.0182 1.0153 1.0149 1.0160 1.0000 1.0055 1.0273 1.0239 1.0087 1.0048 0.9933 1.0081 0.9995 0.9883 0.9887 0.9886
dispcorr: -0.024083398 hartree
energy: -1531.684081521022
dipole: -42.16462 40.81362 -1.35100 -3.95615 3.66434 -0.29181 10.60552 -10.36386 0.24166
magnitude: 1.40313 au
magnitude: 3.56646 debye
