program: Gaussian 09
title: 000064116
version: EM64L-G09RevD.01
frameworkgroup: C1[X(C11H16N4O3)]
method: RPBEPBE
basis: SDD
operation: Freq
keyword: #p
keyword: freq=noraman
keyword: PBEPBE/SDD
title: #p freq=noraman PBEPBE/SDD
converged: NO YES NO NO
title: Mulliken charges:
elementType: O O O N N N N C C C C C C C C C C C H H H H H H H H H H H H H H H H
charge: -0.246741 -0.281448 -0.274232 -0.202798 -0.156236 -0.223336 -0.118369 0.124780 0.087829 0.208403 0.162537 0.209754 -0.613654 -0.615004 -0.226598 -0.601642 -0.387638 -0.676638 0.248630 0.257104 0.257060 0.273009 0.243685 0.243706 0.224658 0.225418 0.268209 0.248293 0.248286 0.217753 0.217865 0.214142 0.229074 0.214139
chargesum: 0.00000
title: Mulliken charges with hydrogens summed into heavy atoms:
elementType: O O O N N N N C C C C C C C C C C C
charge: -0.246741 -0.281448 -0.274232 -0.202798 -0.156236 -0.223336 -0.118369 0.124780 0.087829 0.208403 0.162537 0.209754 0.149140 0.145397 0.223477 0.163146 0.047980 -0.019284
polarizability: 2.28359184e+02 2.24566612e+00 1.71555696e+02 2.38460990e-02 4.69681406e-03 8.95489777e+01
1716.lowfreq: -71.3539 -23.6165 -3.7219 -0.0003 0.0003 0.0003 3.1518 22.7058 41.2829
frequency: -71.3534 9.1095 40.6917 63.4408 72.3485 79.3040 90.8408 116.6982 126.7899 129.5119 143.7743 185.6016 220.6613 230.3327 231.0431 246.2315 250.2860 296.4369 321.3514 343.6494 373.8623 376.4623 390.8039 435.8253 450.7202 504.7306 559.7918 642.2353 646.8891 684.3912 703.1450 720.0885 733.7015 758.1752 758.3768 809.1660 877.7548 892.9421 929.5224 956.0603 979.9144 1029.8504 1047.8903 1050.8390 1128.7407 1129.9879 1131.6720 1134.5435 1145.5057 1167.6678 1189.5065 1216.7190 1227.8423 1228.3048 1265.4904 1277.2881 1297.4300 1304.0223 1361.2397 1366.0845 1392.4404 1403.3764 1412.5995 1427.2306 1448.7612 1463.8794 1466.2389 1472.1737 1475.4694 1476.8156 1478.3627 1479.0751 1480.4620 1481.2637 1489.8437 1503.7200 1512.1912 1577.2887 1615.6236 1651.7880 2981.0286 2998.5311 3005.4619 3005.9391 3010.7403 3014.7306 3045.4124 3067.8879 3086.9126 3087.7181 3094.4500 3102.3760 3106.5690 3135.3943 3136.3750 3137.7287
redmass: 1.0632 2.6186 1.9966 3.9687 1.1003 2.9564 3.6171 3.9209 1.1742 3.1323 3.7111 3.9366 1.1162 5.2992 2.8677 4.3423 6.4110 2.8477 6.7790 3.3971 8.4612 5.4458 7.3000 6.7010 6.7567 5.4109 8.7047 10.7475 5.5102 11.9142 11.3119 7.4147 11.0764 1.6696 1.9209 7.4142 1.1448 2.1621 3.0887 6.0896 3.2228 2.6071 3.0775 2.8607 1.3057 1.2981 1.3012 2.2209 1.4707 2.5726 3.6445 5.2987 1.2476 2.7540 6.7542 1.1002 4.9361 1.4370 2.0964 2.9017 1.2128 2.0733 1.3489 1.2513 2.4065 1.4764 1.0401 1.1539 1.0433 1.1227 1.0431 1.0974 1.0416 1.0968 1.1073 2.4066 2.3095 8.0106 10.8198 10.6128 1.0360 1.0597 1.0452 1.0452 1.0327 1.0331 1.1019 1.1046 1.0992 1.1054 1.1025 1.1022 1.1023 1.1026 1.1023 1.1011
irintensity: 0.0800 0.1436 0.1167 0.1775 0.0686 0.0923 0.3581 0.3813 3.9918 14.4848 5.7715 6.3966 0.0016 0.8699 3.2758 2.5087 0.0538 5.5962 0.0078 7.0628 0.0060 10.7912 14.2808 10.6407 19.7411 21.1694 2.5068 6.5209 9.1282 1.3437 7.2149 11.1791 14.9698 5.0999 4.8258 3.7035 1.9340 9.1485 58.4856 32.9973 188.0489 29.3363 16.5566 6.0225 0.6713 0.2915 0.0307 6.2561 0.3719 87.7194 40.7291 20.4793 0.4843 2.7433 50.2873 0.0184 14.1785 29.2057 133.4197 38.5685 35.2037 52.1122 8.7997 62.6854 581.6055 18.8105 15.8532 14.1664 18.1836 18.9489 15.7406 6.2246 14.0940 2.2621 53.1613 132.5605 188.0350 59.7317 487.4373 496.4577 30.0630 3.5345 2.2458 81.0478 31.2344 22.7254 0.3169 0.8805 40.3650 82.8990 20.1327 18.6350 13.4678 3.6424 0.7407 0.4140
temp: 298.150 k
press: 1.00000 atm
elementType: 8 8 8 7 7 7 7 6 6 6 6 6 6 6 6 6 6 6 1 1 1 1 1 1 1 1 1 1 1 1 1 1 1 1
symmnumber: 1
zpe: 710636.5 jmol-1
zpe.correction: 0.270667 hartree
zpe.thermalcorrener: 0.289030 hartree
zpe.thermalcorrenthalpy: 0.289974 hartree
zpe.thermalcorrgfe: 0.222023 hartree
zpe.sumelectzpe: -872.122945 hartree
zpe.sumelectthermal: -872.104582 hartree
zpe.sumelectthermalent: -872.103638 hartree
zpe.sumelectthermalfe: -872.171590 hartree
dipole: -5.7634 -0.2162 0.0033
dipole: 5.7674
quadrupole: -103.5416 -109.7365 -104.9092
quadrupole: 2.6401 -0.0165 0.0083
quadrupole: 2.5209 -3.6741 1.1532 2.6401 -0.0165 0.0083
hfenergy: -872.3936124 hartree
pointgroup: C01 [X(C11H16N4O3)]
dipole: 2.2670149 0.0966264 0.0006646 debye
polarizability: 228.3347587|2.5354566|171.5800622|-0.0646171|0.0513407|89.5490371 unknown
InChI: InChI=1S/C11H16N4O3/c1-5-6-18-10-12-8-7(13(10)2)9(16)15(4)11(17)14(8)3/h5-6H2,1-4H3
charge 0 multiplicity 1
34 atoms
O  2.826623 -0.680296 -0.004824
O  -2.361172 -2.517389 -0.000686
O  -3.726829 2.002358 0.001755
N  0.562252 -1.393285 -0.003357
N  -1.418323 1.576544 -0.000643
N  -3.01745 -0.232922 0.000691
N  0.952417 0.874038 -0.002699
C  -0.69859 -0.752166 -0.002134
C  -0.414134 0.622131 -0.00177
C  1.496752 -0.374091 -0.003713
C  -2.029141 -1.289053 -0.001015
C  -2.775478 1.167803 0.000689
C  0.8255 -2.839538 -0.003641
C  -1.089115 3.014457 -0.001013
C  3.758224 0.490261 -0.000419
C  -4.444379 -0.629513 0.002539
C  5.177821 -0.073694 -0.009749
C  6.225943 1.061727 0.005795
H  1.91535 -2.990852 -0.003427
H  0.379984 -3.308465 0.888469
H  0.380446 -3.308171 -0.89614
H  -2.03802 3.570115 -0.000433
H  -0.498639 3.267884 -0.89753
H  -0.497424 3.268141 0.894628
H  3.550154 1.094883 0.901884
H  3.542762 1.108389 -0.891648
H  -4.47587 -1.728936 0.002888
H  -4.950594 -0.226966 -0.890066
H  -4.948382 -0.226346 0.89611
H  5.313018 -0.728989 0.870794
H  5.31198 -0.704269 -0.908256
H  6.125209 1.691376 0.909385
H  7.248708 0.646365 -0.001718
H  6.123296 1.718571 -0.878046
