program: Orca
programVersion: 5.0.4
elementType: F F F F F O O N N C C C C C C C C C C C C C C C C C C C C H H H H H H H H H H H H H H H H H
charge: 0
multiplicity: 1
keywords: wb97x-d3
keywords: def2-TZVPP
keywords: def2/J RIJCOSX
keywords: DEFGRID2
keywords: scfconv7
keywords: smallprint printgap noloewdin
keywords: NOSOSCF
formula: C20H17F5N2O2
InChI: InChI=1/C20H17F5N2O2/c21-15-9-8-14(20(23,24)25)17(18(15)22)19(27-29-11-13-6-7-13)26-16(28)10-12-4-2-1-3-5-12/h1-5,8-9,13,26H,6-7,10-11H2
46 atoms
F  1.046158 0.914752 1.822809
F  3.340969 -1.736231 -2.934029
F  1.920779 -2.897271 -1.825739
F  1.308548 -1.059241 -2.760784
F  3.621021 1.334544 2.457726
O  -1.569509 -1.869579 -0.221744
O  0.929594 1.925822 -1.452659
N  -0.228744 -1.746454 0.026726
N  -0.61407 0.437657 -0.703933
C  -2.682609 -2.741444 1.775569
C  -2.069443 -1.775236 2.739428
C  -3.388698 -1.461904 2.094733
C  -2.122274 -3.016219 0.40487
C  0.203772 -0.586839 -0.281456
C  1.649098 -0.352176 -0.049634
C  2.662554 -0.876824 -0.852532
C  2.003275 0.391165 1.057668
C  -0.226459 1.648336 -1.202792
C  -1.36974 2.604455 -1.466532
C  3.992682 -0.664951 -0.520871
C  2.310412 -1.645938 -2.091253
C  -2.497865 2.503883 -0.477379
C  3.329756 0.60906 1.380942
C  4.330481 0.076789 0.600549
C  -2.316438 2.953164 0.82994
C  -3.715817 1.930099 -0.829055
C  -3.332437 2.831605 1.764749
C  -4.735726 1.806988 0.107101
C  -4.54634 2.256979 1.405453
H  -3.107656 -3.638887 2.213908
H  -1.206911 -1.195454 2.436559
H  -2.065437 -2.049727 3.786729
H  -3.404354 -0.681906 1.342106
H  -4.284205 -1.508262 2.701119
H  -2.924961 -3.348154 -0.257015
H  -1.374898 -3.812543 0.442012
H  -1.606508 0.27932 -0.580301
H  -1.730697 2.398945 -2.47894
H  -0.949859 3.610544 -1.480548
H  4.788805 -1.067621 -1.129923
H  5.366501 0.246093 0.860956
H  -1.371052 3.399575 1.116248
H  -3.867582 1.574636 -1.841309
H  -3.177894 3.184765 2.775967
H  -5.677029 1.357071 -0.180508
H  -5.339326 2.161368 2.135523
elementType: F O N C H
totalener: -1531.65657678 hartree
nucrepener: 2979.17324257 hartree
electener: -4510.82981935 hartree
oneelecener: -8028.56172093 hartree
twoeener: 3517.73190158 hartree
cpcmener: -0.03479839 hartree
kineticenergy: 1525.78278316 hartree
xcener: -138.190983984454 hartree
chargesum: 0.0000000
charge: -0.206535 -0.174526 -0.172797 -0.176903 -0.199433 -0.259407 -0.492486 -0.170033 -0.161221 -0.084839 -0.186344 -0.177981 0.083527 0.243170 -0.063157 -0.135120 0.264622 0.359819 -0.054181 -0.079947 0.534199 -0.020192 0.209090 -0.169462 -0.204564 -0.182280 -0.126234 -0.135500 -0.186344 0.085675 0.085086 0.096879 0.055020 0.098424 0.096967 0.086827 0.200242 0.122292 0.110899 0.153341 0.159758 0.145115 0.146930 0.161418 0.159671 0.160517
qa: -0.2065 -0.1745 -0.1728 -0.1769 -0.1994 -0.2594 -0.4925 -0.1700 -0.1612 -0.0848 -0.1863 -0.1780 0.0835 0.2432 -0.0632 -0.1351 0.2646 0.3598 -0.0542 -0.0799 0.5342 -0.0202 0.2091 -0.1695 -0.2046 -0.1823 -0.1262 -0.1355 -0.1863 0.0857 0.0851 0.0969 0.0550 0.0984 0.0970 0.0868 0.2002 0.1223 0.1109 0.1533 0.1598 0.1451 0.1469 0.1614 0.1597 0.1605
va: 1.0913 1.1293 1.1221 1.1202 1.0977 1.9439 2.0064 2.8657 3.2666 3.8307 3.8961 3.8662 3.8716 3.8988 3.8099 3.7530 3.8416 4.1150 3.7887 3.8780 4.4572 3.6326 4.0470 3.9204 3.9474 3.8970 3.8380 3.8219 3.8691 1.0145 1.0255 1.0192 1.0316 1.0182 0.9956 1.0177 1.0128 1.0044 1.0196 1.0038 0.9940 1.0038 1.0025 0.9884 0.9903 0.9905
dispcorr: -0.026182710 hartree
energy: -1531.682759487792
dipole: -40.62882 39.29097 -1.33785 4.14697 -4.22008 -0.07311 14.35405 -13.71753 0.63652
magnitude: 1.48335 au
magnitude: 3.77039 debye
