program: Orca
programVersion: 5.0.4
elementType: F F F F F O O N N C C C C C C C C C C C C C C C C C C C C H H H H H H H H H H H H H H H H H
charge: 0
multiplicity: 1
keywords: wb97x-d3
keywords: def2-TZVPP
keywords: def2/J RIJCOSX
keywords: DEFGRID2
keywords: scfconv7
keywords: smallprint printgap noloewdin
keywords: NOSOSCF
formula: C20H17F5N2O2
InChI: InChI=1/C20H17F5N2O2/c21-15-9-8-14(20(23,24)25)17(18(15)22)19(27-29-11-13-6-7-13)26-16(28)10-12-4-2-1-3-5-12/h1-5,8-9,13,26H,6-7,10-11H2
46 atoms
F  1.310763 0.689819 1.997323
F  1.139586 -0.870615 -2.776014
F  3.145805 -1.52595 -3.174117
F  1.822262 -2.770644 -2.035315
F  3.930741 0.96226 2.472648
O  -1.519162 -1.842946 0.049225
O  0.961779 2.002809 -1.181837
N  -0.160596 -1.730884 0.185351
N  -0.570398 0.449921 -0.547047
C  -2.527304 -2.450533 2.190243
C  -1.859055 -1.376522 2.989493
C  -3.207592 -1.131286 2.376997
C  -2.040812 -2.901793 0.838117
C  0.26021 -0.579073 -0.165007
C  1.725662 -0.381111 -0.043778
C  2.656896 -0.836164 -0.978415
C  2.186614 0.230167 1.103567
C  -0.197064 1.676881 -1.0159
C  -1.346642 2.597094 -1.366612
C  4.013786 -0.67683 -0.739831
C  2.193181 -1.50159 -2.240664
C  -2.612301 2.376675 -0.586644
C  3.539931 0.380616 1.342054
C  4.460429 -0.069667 0.423689
C  -2.726144 2.861706 0.715532
C  -3.677229 1.666842 -1.13472
C  -3.882203 2.646751 1.450406
C  -4.835575 1.4482 -0.399137
C  -4.941353 1.939636 0.893703
H  -2.933574 -3.278555 2.762534
H  -1.008985 -0.850871 2.574528
H  -1.803951 -1.51356 4.061916
H  -3.258569 -0.455416 1.531253
H  -4.070057 -1.087002 3.029569
H  -2.877033 -3.309851 0.266317
H  -1.290943 -3.690833 0.936108
H  -1.56228 0.268321 -0.45358
H  -1.532705 2.461594 -2.436547
H  -0.984907 3.618013 -1.240451
H  4.74912 -1.020746 -1.452505
H  5.518372 0.052802 0.612031
H  -1.903403 3.413485 1.154882
H  -3.600918 1.285738 -2.146199
H  -3.958194 3.032345 2.458821
H  -5.655816 0.896859 -0.840016
H  -5.843729 1.772396 1.467264
elementType: F O N C H
totalener: -1531.65688243 hartree
nucrepener: 2976.40494420 hartree
electener: -4508.06182663 hartree
oneelecener: -8022.95070238 hartree
twoeener: 3514.88887575 hartree
cpcmener: -0.03419284 hartree
kineticenergy: 1525.77809794 hartree
xcener: -138.190681068258 hartree
chargesum: 0.0000000
charge: -0.203838 -0.176682 -0.174232 -0.173613 -0.199249 -0.264386 -0.498113 -0.168022 -0.157767 -0.087700 -0.192459 -0.158844 0.088811 0.231832 -0.057581 -0.122071 0.249522 0.369901 -0.049170 -0.080881 0.533376 -0.025732 0.205921 -0.170811 -0.191010 -0.189654 -0.139170 -0.125956 -0.182496 0.086230 0.088166 0.097056 0.036741 0.099496 0.096432 0.086071 0.199921 0.121384 0.112537 0.151626 0.160115 0.145415 0.148600 0.160882 0.159910 0.159493
qa: -0.2038 -0.1767 -0.1742 -0.1736 -0.1992 -0.2644 -0.4981 -0.1680 -0.1578 -0.0877 -0.1925 -0.1588 0.0888 0.2318 -0.0576 -0.1221 0.2495 0.3699 -0.0492 -0.0809 0.5334 -0.0257 0.2059 -0.1708 -0.1910 -0.1897 -0.1392 -0.1260 -0.1825 0.0862 0.0882 0.0971 0.0367 0.0995 0.0964 0.0861 0.1999 0.1214 0.1125 0.1516 0.1601 0.1454 0.1486 0.1609 0.1599 0.1595
va: 1.0967 1.1208 1.1303 1.1214 1.0980 1.9380 2.0015 2.8693 3.2748 3.8379 3.9011 3.8623 3.8638 3.9040 3.7861 3.7448 3.8827 4.1029 3.8061 3.8863 4.4573 3.6211 4.0463 3.9202 3.9420 3.9008 3.8318 3.8291 3.8672 1.0150 1.0201 1.0197 1.0348 1.0176 0.9957 1.0190 1.0137 1.0045 1.0179 1.0046 0.9938 1.0015 1.0021 0.9894 0.9894 0.9912
dispcorr: -0.026403465 hartree
energy: -1531.683285892558
dipole: -40.84784 39.51114 -1.33669 5.00866 -5.06183 -0.05316 15.03172 -14.56460 0.46711
magnitude: 1.41696 au
magnitude: 3.60162 debye
