program: Orca
programVersion: 5.0.4
elementType: F F F F F O O N N C C C C C C C C C C C C C C C C C C C C H H H H H H H H H H H H H H H H H
charge: 0
multiplicity: 1
keywords: wb97x-d3
keywords: def2-TZVPP
keywords: def2/J RIJCOSX
keywords: DEFGRID2
keywords: scfconv7
keywords: smallprint printgap noloewdin
keywords: NOSOSCF
formula: C20H17F5N2O2
InChI: InChI=1/C20H17F5N2O2/c21-15-9-8-14(20(23,24)25)17(18(15)22)19(27-29-11-13-6-7-13)26-16(28)10-12-4-2-1-3-5-12/h1-5,8-9,13,26H,6-7,10-11H2
46 atoms
F  2.255282 -1.743244 -1.680291
F  0.524571 0.35126 2.878848
F  1.366634 2.300384 2.550477
F  -0.168466 1.562769 1.24517
F  4.841321 -1.135338 -1.308523
O  -1.515926 -2.008653 0.298978
O  0.879812 1.462669 -1.915481
N  -0.216459 -1.67408 0.560459
N  -0.562658 -0.128893 -1.163755
C  -1.352411 -4.393775 0.744678
C  -2.151401 -5.630177 1.017094
C  -1.973501 -5.148471 -0.389423
C  -1.931842 -3.074238 1.148457
C  0.202173 -0.732394 -0.189138
C  1.60464 -0.309315 0.049864
C  1.974662 0.596762 1.044385
C  2.592408 -0.87848 -0.725333
C  -0.236762 0.98754 -1.887461
C  -1.413423 1.595454 -2.614944
C  3.312504 0.907758 1.23863
C  0.927039 1.205161 1.929486
C  -2.34771 2.244299 -1.622328
C  3.924775 -0.563433 -0.532447
C  4.292921 0.329594 0.447201
C  -1.96543 3.408933 -0.958641
C  -3.581718 1.67429 -1.32631
C  -2.804657 3.992453 -0.020913
C  -4.423952 2.258648 -0.389063
C  -4.037537 3.419228 0.265884
H  -0.277388 -4.482931 0.85732
H  -3.126098 -5.511867 1.475306
H  -1.617981 -6.518275 1.329552
H  -2.82837 -4.705259 -0.885972
H  -1.320059 -5.709746 -1.044579
H  -1.684896 -2.831685 2.185732
H  -3.019598 -3.090144 1.059422
H  -1.519131 -0.453354 -1.232147
H  -1.941002 0.823336 -3.178991
H  -1.030798 2.327343 -3.325341
H  3.61721 1.603738 2.006534
H  5.336736 0.573098 0.592127
H  -1.007232 3.864527 -1.179129
H  -3.888688 0.769038 -1.836649
H  -2.496712 4.897874 0.485908
H  -5.38278 1.805892 -0.172466
H  -4.692279 3.87561 0.996752
elementType: F O N C H
totalener: -1531.65921802 hartree
nucrepener: 2937.83015288 hartree
electener: -4469.48937090 hartree
oneelecener: -7946.32673231 hartree
twoeener: 3476.83736141 hartree
cpcmener: -0.03698859 hartree
kineticenergy: 1525.79233312 hartree
xcener: -138.189474766226 hartree
chargesum: -0.0000000
charge: -0.200689 -0.173494 -0.174280 -0.176126 -0.199412 -0.262488 -0.481638 -0.181413 -0.159036 -0.094530 -0.192120 -0.183587 0.073462 0.277151 -0.100840 -0.094515 0.279070 0.345297 -0.058687 -0.106660 0.539450 0.033091 0.186681 -0.157906 -0.233155 -0.193005 -0.140258 -0.147307 -0.173961 0.090696 0.089649 0.096097 0.086530 0.095056 0.085934 0.095241 0.186561 0.125158 0.108662 0.153057 0.160930 0.142941 0.148591 0.161686 0.161786 0.162332
qa: -0.2007 -0.1735 -0.1743 -0.1761 -0.1994 -0.2625 -0.4816 -0.1814 -0.1590 -0.0945 -0.1921 -0.1836 0.0735 0.2772 -0.1008 -0.0945 0.2791 0.3453 -0.0587 -0.1067 0.5394 0.0331 0.1867 -0.1579 -0.2332 -0.1930 -0.1403 -0.1473 -0.1740 0.0907 0.0896 0.0961 0.0865 0.0951 0.0859 0.0952 0.1866 0.1252 0.1087 0.1531 0.1609 0.1429 0.1486 0.1617 0.1618 0.1623
va: 1.1051 1.1211 1.1311 1.1189 1.0968 1.9325 2.0050 2.8845 3.2718 3.7917 3.9258 3.9023 3.8720 3.9154 3.8021 3.7123 3.9057 4.0896 3.7815 3.9234 4.4305 3.5554 4.0269 3.9020 3.9231 3.9314 3.8809 3.8865 3.9025 1.0199 1.0156 1.0144 1.0178 1.0167 1.0141 0.9967 1.0255 1.0120 1.0229 1.0043 0.9933 1.0125 1.0011 0.9889 0.9892 0.9887
dispcorr: -0.023402561 hartree
energy: -1531.682620584336
dipole: -33.58396 32.35021 -1.23375 -13.26313 12.94587 -0.31726 -5.20856 5.27504 0.06648
magnitude: 1.27562 au
magnitude: 3.24237 debye
