program: Orca
programVersion: 5.0.4
elementType: F F F F F O O N N C C C C C C C C C C C C C C C C C C C C H H H H H H H H H H H H H H H H H
charge: 0
multiplicity: 1
keywords: wb97x-d3
keywords: def2-TZVPP
keywords: def2/J RIJCOSX
keywords: DEFGRID2
keywords: scfconv7
keywords: smallprint printgap noloewdin
keywords: NOSOSCF
formula: C20H17F5N2O2
InChI: InChI=1/C20H17F5N2O2/c21-15-9-8-14(20(23,24)25)17(18(15)22)19(27-29-11-13-6-7-13)26-16(28)10-12-4-2-1-3-5-12/h1-5,8-9,13,26H,6-7,10-11H2
46 atoms
F  0.861604 1.586166 1.492405
F  0.601972 -1.775755 -2.227208
F  2.61911 -2.481875 -2.421277
F  1.383942 -3.212106 -0.82785
F  3.481798 2.065929 1.722122
O  -1.9542 -1.605449 0.767934
O  0.399679 1.47775 -1.932727
N  -0.59496 -1.470239 0.759411
N  -1.069933 0.395676 -0.577791
C  -2.182287 -4.031865 0.643187
C  -0.915846 -4.828607 0.716566
C  -2.159624 -5.344493 1.366712
C  -2.353498 -2.786604 1.457753
C  -0.212603 -0.475025 0.060663
C  1.249656 -0.222407 0.053841
C  2.170466 -0.999298 -0.650539
C  1.723632 0.812925 0.833281
C  -0.722562 1.360982 -1.483097
C  -1.859943 2.291751 -1.833423
C  3.528718 -0.739609 -0.541228
C  1.694585 -2.116485 -1.531138
C  -2.205588 3.154476 -0.644677
C  3.077947 1.066685 0.942908
C  3.988188 0.292854 0.261222
C  -1.318284 4.140228 -0.216393
C  -3.385257 2.95477 0.064395
C  -1.609808 4.913718 0.897337
C  -3.678642 3.729125 1.179853
C  -2.790589 4.708425 1.600418
H  -2.695751 -4.022961 -0.312593
H  -0.123705 -4.465651 1.358703
H  -0.572503 -5.315433 -0.186822
H  -2.210387 -5.325973 2.448791
H  -2.672862 -6.182001 0.913059
H  -1.820007 -2.864976 2.410134
H  -3.408455 -2.619454 1.680802
H  -2.048409 0.325858 -0.328594
H  -2.73025 1.707782 -2.140771
H  -1.549346 2.901693 -2.680943
H  4.254344 -1.332079 -1.079015
H  5.046423 0.497375 0.350363
H  -0.395928 4.306929 -0.760426
H  -4.081089 2.190096 -0.260029
H  -0.91351 5.677772 1.217813
H  -4.601521 3.564576 1.720665
H  -3.017283 5.311545 2.469803
elementType: F O N C H
totalener: -1531.65941146 hartree
nucrepener: 2937.96367393 hartree
electener: -4469.62308539 hartree
oneelecener: -7946.74319711 hartree
twoeener: 3477.12011172 hartree
cpcmener: -0.03741782 hartree
kineticenergy: 1525.78758186 hartree
xcener: -138.189043288325 hartree
chargesum: -0.0000000
charge: -0.202248 -0.179319 -0.174861 -0.168485 -0.199508 -0.259166 -0.483291 -0.156933 -0.157696 -0.068607 -0.172727 -0.209097 0.045077 0.260970 -0.076698 -0.116616 0.263182 0.340301 -0.059606 -0.084042 0.534922 0.025803 0.203261 -0.171737 -0.227342 -0.190095 -0.139042 -0.147364 -0.174237 0.089401 0.076652 0.094201 0.089947 0.096033 0.086816 0.103982 0.187468 0.124321 0.108797 0.152021 0.160454 0.143668 0.148008 0.161055 0.160946 0.161431
qa: -0.2022 -0.1793 -0.1749 -0.1685 -0.1995 -0.2592 -0.4833 -0.1569 -0.1577 -0.0686 -0.1727 -0.2091 0.0451 0.2610 -0.0767 -0.1166 0.2632 0.3403 -0.0596 -0.0840 0.5349 0.0258 0.2033 -0.1717 -0.2273 -0.1901 -0.1390 -0.1474 -0.1742 0.0894 0.0767 0.0942 0.0899 0.0960 0.0868 0.1040 0.1875 0.1243 0.1088 0.1520 0.1605 0.1437 0.1480 0.1611 0.1609 0.1614
va: 1.1004 1.1182 1.1292 1.1231 1.0971 1.9416 2.0018 2.9072 3.2648 3.7743 3.8743 3.9479 3.8729 3.9630 3.7912 3.7311 3.8981 4.1056 3.7780 3.8904 4.4332 3.5729 4.0204 3.9178 3.9283 3.9269 3.8768 3.8869 3.9006 1.0149 1.0299 1.0188 1.0148 1.0161 1.0137 1.0001 1.0231 1.0121 1.0228 1.0046 0.9939 1.0107 1.0014 0.9891 0.9894 0.9890
dispcorr: -0.023863569 hartree
energy: -1531.683275029329
dipole: -30.47580 29.25604 -1.21976 -1.74874 1.70794 -0.04080 8.86477 -8.35652 0.50826
magnitude: 1.32204 au
magnitude: 3.36037 debye
