program: Orca
programVersion: 5.0.4
elementType: F F F F F O O N N C C C C C C C C C C C C C C C C C C C C H H H H H H H H H H H H H H H H H
charge: 0
multiplicity: 1
keywords: wb97x-d3
keywords: def2-TZVPP
keywords: def2/J RIJCOSX
keywords: DEFGRID2
keywords: scfconv7
keywords: smallprint printgap noloewdin
keywords: NOSOSCF
formula: C20H17F5N2O2
InChI: InChI=1/C20H17F5N2O2/c21-15-9-8-14(20(23,24)25)17(18(15)22)19(27-29-11-13-6-7-13)26-16(28)10-12-4-2-1-3-5-12/h1-5,8-9,13,26H,6-7,10-11H2
46 atoms
F  2.276953 0.140091 2.309822
F  1.009253 -0.475031 -3.440468
F  0.163148 -1.9197 -2.0976
F  -0.412607 0.14503 -1.954731
F  4.814764 0.161527 1.442612
O  -1.57983 -1.512413 1.470639
O  0.809633 2.415539 0.222843
N  -0.311507 -1.504719 0.963523
N  -0.623801 0.816038 0.976519
C  -1.371078 -3.282358 3.13205
C  -1.259057 -4.755932 3.382048
C  -0.026109 -3.941851 3.148666
C  -1.975062 -2.830182 1.839126
C  0.107553 -0.325154 0.723986
C  1.47382 -0.247017 0.14821
C  1.749832 -0.425711 -1.208369
C  2.526818 -0.045573 1.014978
C  -0.291203 2.096021 0.623153
C  -1.4438 3.06754 0.723528
C  3.061581 -0.403255 -1.658939
C  0.629608 -0.668218 -2.176596
C  -2.348959 2.859994 -0.466663
C  3.833532 -0.027024 0.564013
C  4.109016 -0.203998 -0.772556
C  -1.933348 3.25144 -1.737658
C  -3.578731 2.225487 -0.324447
C  -2.732861 3.009602 -2.844964
C  -4.382033 1.986349 -1.431866
C  -3.959571 2.374589 -2.695173
H  -1.62253 -2.669632 3.99152
H  -1.579989 -5.428017 2.595214
H  -1.458916 -5.116345 4.382465
H  0.490215 -4.064689 2.205247
H  0.624113 -3.743381 3.990714
H  -3.061355 -2.7700 1.922608
H  -1.740462 -3.529964 1.030921
H  -1.564608 0.66901 1.320066
H  -1.038626 4.078645 0.73581
H  -1.996764 2.912128 1.651719
H  3.295257 -0.54202 -2.704479
H  5.132701 -0.187874 -1.120971
H  -0.977926 3.746988 -1.86336
H  -3.910675 1.917035 0.659834
H  -2.397904 3.317359 -3.827001
H  -5.337852 1.494765 -1.305459
H  -4.58336 2.186164 -3.559121
elementType: F O N C H
totalener: -1531.65875281 hartree
nucrepener: 2951.04434686 hartree
electener: -4482.70309967 hartree
oneelecener: -7972.93745526 hartree
twoeener: 3490.23435559 hartree
cpcmener: -0.03717757 hartree
kineticenergy: 1525.79182020 hartree
xcener: -138.189905049723 hartree
chargesum: -0.0000000
charge: -0.202155 -0.174320 -0.173098 -0.176719 -0.199532 -0.260588 -0.485518 -0.169744 -0.157047 -0.083330 -0.209327 -0.164139 0.046701 0.268917 -0.096940 -0.099922 0.279914 0.344256 -0.054083 -0.102428 0.540589 0.033175 0.189509 -0.159110 -0.223506 -0.195598 -0.146761 -0.146409 -0.172334 0.089875 0.090635 0.097160 0.077375 0.097051 0.103179 0.089204 0.186283 0.110549 0.121172 0.153185 0.160959 0.142089 0.147262 0.160440 0.161431 0.161699
qa: -0.2022 -0.1743 -0.1731 -0.1767 -0.1995 -0.2606 -0.4855 -0.1697 -0.1570 -0.0833 -0.2093 -0.1641 0.0467 0.2689 -0.0969 -0.0999 0.2799 0.3443 -0.0541 -0.1024 0.5406 0.0332 0.1895 -0.1591 -0.2235 -0.1956 -0.1468 -0.1464 -0.1723 0.0899 0.0906 0.0972 0.0774 0.0971 0.1032 0.0892 0.1863 0.1105 0.1212 0.1532 0.1610 0.1421 0.1473 0.1604 0.1614 0.1617
va: 1.1024 1.1307 1.1222 1.1185 1.0967 1.9392 2.0009 2.8769 3.2791 3.7758 3.9418 3.8756 3.8729 3.9136 3.7943 3.7238 3.8897 4.0875 3.7864 3.9122 4.4301 3.5570 4.0280 3.9029 3.9357 3.9337 3.8906 3.8831 3.9012 1.0143 1.0142 1.0156 1.0314 1.0152 1.0011 1.0131 1.0260 1.0231 1.0145 1.0044 0.9935 1.0149 1.0019 0.9896 0.9894 0.9889
dispcorr: -0.023757544 hartree
energy: -1531.682510356924
dipole: -27.89774 26.68123 -1.21651 -5.56463 5.27032 -0.29432 13.16994 -12.82981 0.34013
magnitude: 1.29700 au
magnitude: 3.29672 debye
