program: Orca
programVersion: 5.0.4
elementType: F F F F F O O N N C C C C C C C C C C C C C C C C C C C C H H H H H H H H H H H H H H H H H
charge: 0
multiplicity: 1
keywords: wb97x-d3
keywords: def2-TZVPP
keywords: def2/J RIJCOSX
keywords: DEFGRID2
keywords: scfconv7
keywords: smallprint printgap noloewdin
keywords: NOSOSCF
formula: C20H17F5N2O2
InChI: InChI=1/C20H17F5N2O2/c21-15-9-8-14(20(23,24)25)17(18(15)22)19(27-29-11-13-6-7-13)26-16(28)10-12-4-2-1-3-5-12/h1-5,8-9,13,26H,6-7,10-11H2
46 atoms
F  1.141201 1.254451 1.604451
F  1.831454 -3.101759 -1.450764
F  1.253517 -1.405476 -2.642064
F  3.266156 -2.150698 -2.729253
F  3.726909 1.667176 2.127978
O  -1.611152 -1.725145 -0.152991
O  0.98815 1.903878 -1.628253
N  -0.271922 -1.630665 0.109848
N  -0.582728 0.50732 -0.766096
C  -2.436817 -2.520731 1.989583
C  -3.58126 -1.631997 2.369066
C  -3.652477 -3.101688 2.64416
C  -2.198354 -2.820392 0.54189
C  0.202857 -0.509183 -0.270216
C  1.655967 -0.305697 -0.066804
C  2.637919 -0.981927 -0.792483
C  2.058179 0.580012 0.912298
C  -0.168984 1.677106 -1.336137
C  -1.291812 2.655817 -1.610503
C  3.980526 -0.775796 -0.510835
C  2.246843 -1.912973 -1.900938
C  -2.351598 2.660595 -0.543375
C  3.396524 0.794041 1.180696
C  4.365426 0.113258 0.479863
C  -3.576525 2.031525 -0.744569
C  -2.0866 3.241507 0.695977
C  -4.518586 1.97421 0.275525
C  -3.029089 3.19349 1.711538
C  -4.246511 2.554705 1.505534
H  -1.544822 -2.45308 2.603163
H  -4.199223 -1.230641 1.574141
H  -3.445314 -0.960565 3.206875
H  -4.317101 -3.701237 2.033736
H  -3.564411 -3.440604 3.667847
H  -3.145282 -2.996235 0.027728
H  -1.577279 -3.711065 0.414247
H  -1.577884 0.3873 -0.623061
H  -1.725168 2.389684 -2.579212
H  -0.840494 3.641525 -1.723953
H  4.750465 -1.293997 -1.063402
H  5.411302 0.281092 0.698037
H  -3.792678 1.575932 -1.703791
H  -1.13461 3.731066 0.866085
H  -5.464842 1.477263 0.105819
H  -2.812487 3.650332 2.668422
H  -4.979277 2.512505 2.300765
elementType: F O N C H
totalener: -1531.65906294 hartree
nucrepener: 2947.33970535 hartree
electener: -4478.99876829 hartree
oneelecener: -7965.09121475 hartree
twoeener: 3486.09244646 hartree
cpcmener: -0.03538686 hartree
kineticenergy: 1525.80581620 hartree
xcener: -138.193323318554 hartree
chargesum: -0.0000000
charge: -0.202280 -0.172431 -0.177931 -0.175325 -0.198858 -0.262850 -0.489171 -0.182960 -0.173263 -0.085892 -0.189106 -0.195311 0.071502 0.271958 -0.079970 -0.129244 0.269657 0.348308 -0.050200 -0.082787 0.536070 -0.002678 0.206093 -0.167946 -0.194477 -0.213318 -0.158853 -0.129262 -0.167585 0.091985 0.087770 0.097144 0.089784 0.096814 0.095915 0.089854 0.202087 0.123718 0.109218 0.152060 0.160404 0.151656 0.144168 0.161596 0.162467 0.161469
qa: -0.2023 -0.1724 -0.1779 -0.1753 -0.1989 -0.2628 -0.4892 -0.1830 -0.1733 -0.0859 -0.1891 -0.1953 0.0715 0.2720 -0.0800 -0.1292 0.2697 0.3483 -0.0502 -0.0828 0.5361 -0.0027 0.2061 -0.1679 -0.1945 -0.2133 -0.1589 -0.1293 -0.1676 0.0920 0.0878 0.0971 0.0898 0.0968 0.0959 0.0899 0.2021 0.1237 0.1092 0.1521 0.1604 0.1517 0.1442 0.1616 0.1625 0.1615
va: 1.1010 1.1215 1.1208 1.1279 1.0981 1.9375 2.0083 2.8757 3.2647 3.7765 3.8910 3.9445 3.8685 3.8996 3.7875 3.7694 3.8576 4.1265 3.7868 3.8822 4.4511 3.6112 4.0311 3.9198 3.8886 3.9466 3.8540 3.8613 3.8752 1.0166 1.0192 1.0173 1.0159 1.0145 0.9978 1.0143 1.0137 1.0039 1.0213 1.0049 0.9939 1.0012 1.0049 0.9900 0.9880 0.9892
dispcorr: -0.024317468 hartree
energy: -1531.683380403284
dipole: -42.42562 41.06458 -1.36103 3.35193 -3.35447 -0.00254 14.68315 -13.95496 0.72819
magnitude: 1.54359 au
magnitude: 3.92350 debye
