program: Orca
programVersion: 5.0.4
elementType: F F F F F O O N N C C C C C C C C C C C C C C C C C C C C H H H H H H H H H H H H H H H H H
charge: 0
multiplicity: 1
keywords: wb97x-d3
keywords: def2-TZVPP
keywords: def2/J RIJCOSX
keywords: DEFGRID2
keywords: scfconv7
keywords: smallprint printgap noloewdin
keywords: NOSOSCF
formula: C20H17F5N2O2
InChI: InChI=1/C20H17F5N2O2/c21-15-9-8-14(20(23,24)25)17(18(15)22)19(27-29-11-13-6-7-13)26-16(28)10-12-4-2-1-3-5-12/h1-5,8-9,13,26H,6-7,10-11H2
46 atoms
F  2.336396 0.163321 2.24428
F  1.005042 -0.575635 -3.474823
F  0.152034 -1.990988 -2.102608
F  -0.398249 0.082757 -1.989103
F  4.86653 0.070077 1.359194
O  -1.570612 -1.368393 1.525237
O  0.900257 2.417956 0.049812
N  -0.311125 -1.432604 0.996322
N  -0.553397 0.891567 0.907113
C  -1.401576 -3.065534 3.270797
C  -1.327648 -4.532305 3.571593
C  -0.07525 -3.761147 3.299865
C  -2.009813 -2.648591 1.967229
C  0.140837 -0.2796 0.694554
C  1.502238 -0.267969 0.101849
C  1.763234 -0.503968 -1.248847
C  2.56878 -0.073131 0.954439
C  -0.19831 2.145626 0.489339
C  -1.326879 3.146005 0.581109
C  3.072257 -0.546779 -1.706892
C  0.632639 -0.745477 -2.204823
C  -2.326014 2.860683 -0.514114
C  3.871873 -0.116826 0.495423
C  4.132086 -0.353669 -0.83483
C  -3.572428 2.315948 -0.223349
C  -1.984667 3.094363 -1.844901
C  -4.464851 2.011975 -1.243573
C  -2.872893 2.787202 -2.864549
C  -4.116695 2.244388 -2.566571
H  -1.627782 -2.414902 4.109198
H  -1.674389 -5.219656 2.809073
H  -1.528523 -4.855734 4.584311
H  0.431965 -3.93132 2.359033
H  0.585084 -3.550705 4.13118
H  -3.090781 -2.538643 2.0691
H  -1.822175 -3.396441 1.190678
H  -1.486281 0.780679 1.284421
H  -0.908112 4.146358 0.477396
H  -1.808128 3.080885 1.55911
H  3.291251 -0.733155 -2.748144
H  5.153835 -0.389745 -1.187489
H  -3.848618 2.128561 0.807611
H  -1.016625 3.518181 -2.085052
H  -5.432663 1.591562 -1.002812
H  -2.593731 2.972468 -3.893663
H  -4.81056 2.005969 -3.361985
elementType: F O N C H
totalener: -1531.65880797 hartree
nucrepener: 2949.49694540 hartree
electener: -4481.15575337 hartree
oneelecener: -7969.78750041 hartree
twoeener: 3488.63174704 hartree
cpcmener: -0.03680936 hartree
kineticenergy: 1525.78541538 hartree
xcener: -138.188628458965 hartree
chargesum: 0.0000000
charge: -0.202097 -0.174435 -0.173950 -0.175582 -0.199517 -0.260256 -0.484482 -0.172203 -0.156459 -0.083358 -0.209170 -0.164382 0.045795 0.273369 -0.096534 -0.094450 0.276407 0.345480 -0.055195 -0.102789 0.537088 0.029472 0.190037 -0.159861 -0.194255 -0.227857 -0.146436 -0.143320 -0.172258 0.090268 0.090410 0.097142 0.078126 0.096987 0.102685 0.089280 0.185891 0.109281 0.122684 0.152473 0.160924 0.148024 0.142955 0.161370 0.161032 0.161666
qa: -0.2021 -0.1744 -0.1740 -0.1756 -0.1995 -0.2603 -0.4845 -0.1722 -0.1565 -0.0834 -0.2092 -0.1644 0.0458 0.2734 -0.0965 -0.0944 0.2764 0.3455 -0.0552 -0.1028 0.5371 0.0295 0.1900 -0.1599 -0.1943 -0.2279 -0.1464 -0.1433 -0.1723 0.0903 0.0904 0.0971 0.0781 0.0970 0.1027 0.0893 0.1859 0.1093 0.1227 0.1525 0.1609 0.1480 0.1430 0.1614 0.1610 0.1617
va: 1.1025 1.1304 1.1207 1.1194 1.0967 1.9384 2.0021 2.8773 3.2735 3.7753 3.9414 3.8758 3.8720 3.9115 3.8006 3.7188 3.8960 4.0864 3.7845 3.9164 4.4334 3.5638 4.0273 3.9038 3.9307 3.9208 3.8842 3.8842 3.9020 1.0140 1.0141 1.0157 1.0315 1.0153 1.0013 1.0132 1.0270 1.0229 1.0133 1.0048 0.9935 1.0015 1.0138 0.9893 0.9892 0.9889
dispcorr: -0.023746229 hartree
energy: -1531.682554200144
dipole: -28.48302 27.27409 -1.20893 -4.40218 4.16496 -0.23722 14.40088 -13.99121 0.40967
magnitude: 1.29831 au
magnitude: 3.30004 debye
