program: Orca
programVersion: 5.0.4
elementType: F F F F F O O N N C C C C C C C C C C C C C C C C C C C C H H H H H H H H H H H H H H H H H
charge: 0
multiplicity: 1
keywords: wb97x-d3
keywords: def2-TZVPP
keywords: def2/J RIJCOSX
keywords: DEFGRID2
keywords: scfconv7
keywords: smallprint printgap noloewdin
keywords: NOSOSCF
formula: C20H17F5N2O2
InChI: InChI=1/C20H17F5N2O2/c21-15-9-8-14(20(23,24)25)17(18(15)22)19(27-29-11-13-6-7-13)26-16(28)10-12-4-2-1-3-5-12/h1-5,8-9,13,26H,6-7,10-11H2
46 atoms
F  1.26848 0.814252 1.93099
F  1.73172 -2.827365 -1.903525
F  1.171657 -0.951118 -2.789366
F  3.15428 -1.731162 -3.074903
F  3.882844 1.125321 2.403938
O  -1.614748 -1.669688 0.070239
O  1.058296 1.948211 -1.412414
N  -0.255213 -1.620438 0.216498
N  -0.545563 0.531952 -0.644666
C  -2.252791 -2.495411 2.270055
C  -3.345714 -1.612044 2.789581
C  -3.399309 -3.08821 3.030623
C  -2.165833 -2.76363 0.798687
C  0.228808 -0.512874 -0.190062
C  1.697367 -0.357325 -0.049983
C  2.634938 -0.868812 -0.948651
C  2.150524 0.310348 1.068332
C  -0.112254 1.703004 -1.198731
C  -1.219016 2.665421 -1.576115
C  3.990127 -0.701536 -0.706114
C  2.175908 -1.595383 -2.178583
C  -2.426696 2.606917 -0.683945
C  3.502116 0.475261 1.30745
C  4.428915 -0.027104 0.423594
C  -3.574094 1.92095 -1.072014
C  -2.38953 3.199495 0.577168
C  -4.662606 1.821242 -0.213996
C  -3.475772 3.1043 1.433194
C  -4.61503 2.410858 1.04093
H  -1.302492 -2.44983 2.791464
H  -4.03943 -1.186004 2.074509
H  -3.119911 -0.965623 3.627743
H  -4.127408 -3.66802 2.476229
H  -3.209004 -3.455161 4.030593
H  -3.163201 -2.901711 0.377142
H  -1.585897 -3.667388 0.593512
H  -1.544229 0.412113 -0.528287
H  -1.496237 2.43546 -2.609542
H  -0.784024 3.665022 -1.581955
H  4.730044 -1.088496 -1.39135
H  5.485566 0.10632 0.611975
H  -3.615818 1.45875 -2.051263
H  -1.501244 3.735762 0.890074
H  -5.547019 1.283036 -0.529122
H  -3.433661 3.569804 2.409275
H  -5.461936 2.334719 1.710172
elementType: F O N C H
totalener: -1531.66002472 hartree
nucrepener: 2934.24751860 hartree
electener: -4465.90754332 hartree
oneelecener: -7938.90503593 hartree
twoeener: 3472.99749261 hartree
cpcmener: -0.03515295 hartree
kineticenergy: 1525.77931233 hartree
xcener: -138.188308358259 hartree
chargesum: -0.0000000
charge: -0.202860 -0.174030 -0.176858 -0.174113 -0.199424 -0.263747 -0.497289 -0.182007 -0.169498 -0.089691 -0.181151 -0.197160 0.071659 0.266986 -0.086279 -0.114852 0.264942 0.367839 -0.046017 -0.084790 0.531545 -0.017656 0.198137 -0.165872 -0.191743 -0.201821 -0.150894 -0.136343 -0.170507 0.091732 0.085160 0.096015 0.089836 0.096847 0.097711 0.088938 0.199016 0.122305 0.110543 0.153240 0.160584 0.149466 0.146688 0.161622 0.161505 0.162290
qa: -0.2029 -0.1740 -0.1769 -0.1741 -0.1994 -0.2637 -0.4973 -0.1820 -0.1695 -0.0897 -0.1812 -0.1972 0.0717 0.2670 -0.0863 -0.1149 0.2649 0.3678 -0.0460 -0.0848 0.5315 -0.0177 0.1981 -0.1659 -0.1917 -0.2018 -0.1509 -0.1363 -0.1705 0.0917 0.0852 0.0960 0.0898 0.0968 0.0977 0.0889 0.1990 0.1223 0.1105 0.1532 0.1606 0.1495 0.1467 0.1616 0.1615 0.1623
va: 1.1015 1.1217 1.1205 1.1306 1.0974 1.9363 2.0014 2.8820 3.2801 3.7776 3.8958 3.9407 3.8618 3.9054 3.8238 3.7308 3.9038 4.0992 3.8051 3.8901 4.4591 3.6243 4.0255 3.9124 3.8960 3.9528 3.8684 3.8635 3.8849 1.0170 1.0187 1.0170 1.0159 1.0143 0.9973 1.0152 1.0178 1.0036 1.0195 1.0042 0.9937 1.0023 1.0018 0.9895 0.9890 0.9891
dispcorr: -0.023763580 hartree
energy: -1531.683788301566
dipole: -42.16023 40.82895 -1.33128 3.07452 -3.05604 0.01848 15.49784 -14.96583 0.53200
magnitude: 1.43377 au
magnitude: 3.64434 debye
