program: Orca
programVersion: 5.0.4
elementType: F F F F F O O N N C C C C C C C C C C C C C C C C C C C C H H H H H H H H H H H H H H H H H
charge: 0
multiplicity: 1
keywords: wb97x-d3
keywords: def2-TZVPP
keywords: def2/J RIJCOSX
keywords: DEFGRID2
keywords: scfconv7
keywords: smallprint printgap noloewdin
keywords: NOSOSCF
formula: C20H17F5N2O2
InChI: InChI=1/C20H17F5N2O2/c21-15-9-8-14(20(23,24)25)17(18(15)22)19(27-29-11-13-6-7-13)26-16(28)10-12-4-2-1-3-5-12/h1-5,8-9,13,26H,6-7,10-11H2
46 atoms
F  1.222733 0.93656 1.814698
F  1.206431 -1.052712 -2.797904
F  3.198118 -1.828771 -3.028751
F  1.767698 -2.894438 -1.840339
F  3.829827 1.312564 2.293835
O  -1.59893 -1.712509 -0.072943
O  0.997814 1.939642 -1.513468
N  -0.245579 -1.647813 0.112296
N  -0.565751 0.52877 -0.662287
C  -2.307812 -2.531414 2.103609
C  -3.399465 -1.617018 2.568027
C  -3.501051 -3.089345 2.817217
C  -2.165436 -2.808172 0.6392
C  0.226001 -0.519036 -0.248541
C  1.688637 -0.339171 -0.090732
C  2.642826 -0.89349 -0.945004
C  2.121535 0.394849 0.993782
C  -0.156796 1.708394 -1.213712
C  -1.275241 2.694484 -1.480315
C  3.99349 -0.709636 -0.689333
C  2.206012 -1.670095 -2.151612
C  -2.414093 2.619519 -0.502731
C  3.46853 0.587095 1.23927
C  4.41151 0.032844 0.404578
C  -3.604835 1.978659 -0.833085
C  -2.266494 3.148122 0.77871
C  -4.626654 1.859148 0.101205
C  -3.286464 3.034527 1.710425
C  -4.469414 2.386051 1.374699
H  -1.38157 -2.503609 2.667279
H  -4.048524 -1.178757 1.818606
H  -3.193258 -0.9691 3.410032
H  -4.217974 -3.6553 2.234684
H  -3.36338 -3.452186 3.827415
H  -3.146055 -2.954028 0.182131
H  -1.572017 -3.708502 0.458201
H  -1.559033 0.409232 -0.502483
H  -1.630803 2.500755 -2.497324
H  -0.828115 3.688746 -1.488576
H  4.746709 -1.132143 -1.337946
H  5.464536 0.183387 0.59995
H  -3.732242 1.566798 -1.827223
H  -1.344204 3.649553 1.047521
H  -5.545984 1.35648 -0.169644
H  -3.158651 3.45043 2.701271
H  -5.264009 2.293925 2.103319
elementType: F O N C H
totalener: -1531.65974739 hartree
nucrepener: 2942.42228609 hartree
electener: -4474.08203348 hartree
oneelecener: -7955.25142730 hartree
twoeener: 3481.16939382 hartree
cpcmener: -0.03542798 hartree
kineticenergy: 1525.79737530 hartree
xcener: -138.191666745212 hartree
chargesum: -0.0000000
charge: -0.202942 -0.177428 -0.174300 -0.172795 -0.199209 -0.263581 -0.496491 -0.181852 -0.170151 -0.087281 -0.184456 -0.196962 0.072346 0.267994 -0.084390 -0.122169 0.266520 0.360993 -0.048082 -0.083687 0.532894 -0.013562 0.202369 -0.166197 -0.190128 -0.208695 -0.152653 -0.129245 -0.173452 0.092149 0.086051 0.095960 0.090025 0.097233 0.096951 0.089826 0.200062 0.122913 0.110963 0.153883 0.160335 0.149703 0.145655 0.161278 0.161955 0.161650
qa: -0.2029 -0.1774 -0.1743 -0.1728 -0.1992 -0.2636 -0.4965 -0.1819 -0.1702 -0.0873 -0.1845 -0.1970 0.0723 0.2680 -0.0844 -0.1222 0.2665 0.3610 -0.0481 -0.0837 0.5329 -0.0136 0.2024 -0.1662 -0.1901 -0.2087 -0.1527 -0.1292 -0.1735 0.0921 0.0861 0.0960 0.0900 0.0972 0.0970 0.0898 0.2001 0.1229 0.1110 0.1539 0.1603 0.1497 0.1457 0.1613 0.1620 0.1616
va: 1.1007 1.1200 1.1300 1.1226 1.0977 1.9368 2.0022 2.8803 3.2746 3.7750 3.8905 3.9451 3.8634 3.8994 3.8109 3.7469 3.8893 4.1114 3.7981 3.8831 4.4571 3.6193 4.0278 3.9154 3.8930 3.9546 3.8547 3.8557 3.8779 1.0163 1.0191 1.0174 1.0160 1.0143 0.9979 1.0149 1.0162 1.0037 1.0198 1.0039 0.9938 1.0020 1.0027 0.9899 0.9884 0.9894
dispcorr: -0.024183511 hartree
energy: -1531.683930905631
dipole: -42.25151 40.91748 -1.33403 2.95532 -2.93558 0.01975 15.91066 -15.17629 0.73438
magnitude: 1.52294 au
magnitude: 3.87100 debye
