program: Orca
programVersion: 5.0.4
elementType: F F F F F O O N N C C C C C C C C C C C C C C C C C C C C H H H H H H H H H H H H H H H H H
charge: 0
multiplicity: 1
keywords: wb97x-d3
keywords: def2-TZVPP
keywords: def2/J RIJCOSX
keywords: DEFGRID2
keywords: scfconv7
keywords: smallprint printgap noloewdin
keywords: NOSOSCF
formula: C20H17F5N2O2
InChI: InChI=1/C20H17F5N2O2/c21-15-9-8-14(20(23,24)25)17(18(15)22)19(27-29-11-13-6-7-13)26-16(28)10-12-4-2-1-3-5-12/h1-5,8-9,13,26H,6-7,10-11H2
46 atoms
F  0.682049 -0.303996 -2.238597
F  3.967425 -0.005766 2.662615
F  1.885493 0.514636 2.573492
F  2.478758 -1.552502 2.631089
F  3.062299 -0.409121 -3.458662
O  -1.342626 -1.394304 1.419518
O  1.090614 2.35874 -0.08613
N  -0.079632 -1.473665 0.891214
N  -0.460988 0.783537 0.428964
C  -2.421463 -2.959589 -0.084869
C  -3.732413 -3.645721 -0.315547
C  -3.570305 -2.202176 -0.675921
C  -2.00394 -2.652444 1.320397
C  0.326105 -0.345125 0.457294
C  1.689033 -0.335972 -0.12684
C  2.861444 -0.379859 0.62688
C  1.790884 -0.348605 -1.502135
C  -0.06691 2.054404 0.122459
C  -1.184712 3.075657 0.107654
C  4.093773 -0.447471 -0.005221
C  2.798209 -0.356745 2.123748
C  -2.529352 2.535212 -0.291698
C  3.020895 -0.404344 -2.129746
C  4.178097 -0.459035 -1.387876
C  -2.80328 2.268886 -1.632269
C  -3.499586 2.245808 0.663595
C  -4.020978 1.723122 -2.00867
C  -4.719001 1.695093 0.288846
C  -4.981803 1.431844 -1.047622
H  -1.616335 -3.224131 -0.761925
H  -4.336238 -3.888889 0.550038
H  -3.787632 -4.373534 -1.114211
H  -4.063078 -1.464555 -0.053415
H  -3.518501 -1.935602 -1.723281
H  -1.362832 -3.438573 1.729516
H  -2.876567 -2.557406 1.969083
H  -1.440511 0.632175 0.63659
H  -0.871526 3.878526 -0.559847
H  -1.230073 3.503472 1.113588
H  5.009877 -0.486642 0.564973
H  5.138313 -0.506325 -1.882759
H  -2.055914 2.490172 -2.385137
H  -3.298176 2.449097 1.708626
H  -4.221271 1.523253 -3.053232
H  -5.463799 1.475426 1.042387
H  -5.931095 1.003365 -1.341229
elementType: F O N C H
totalener: -1531.65939463 hartree
nucrepener: 2955.39684340 hartree
electener: -4487.05623803 hartree
oneelecener: -7981.09348677 hartree
twoeener: 3494.03724874 hartree
cpcmener: -0.03523847 hartree
kineticenergy: 1525.81473563 hartree
xcener: -138.194930315882 hartree
chargesum: 0.0000000
charge: -0.203552 -0.174746 -0.177172 -0.172914 -0.198896 -0.273438 -0.496095 -0.186391 -0.165438 -0.085480 -0.196894 -0.189816 0.079099 0.269614 -0.075461 -0.121980 0.263001 0.364941 -0.047312 -0.083422 0.532004 -0.013542 0.202276 -0.168132 -0.203157 -0.191802 -0.126500 -0.140877 -0.187439 0.091326 0.090795 0.097400 0.087651 0.097341 0.090750 0.096243 0.196128 0.111032 0.121567 0.152193 0.160848 0.145074 0.148861 0.160585 0.160336 0.161392
qa: -0.2036 -0.1747 -0.1772 -0.1729 -0.1989 -0.2734 -0.4961 -0.1864 -0.1654 -0.0855 -0.1969 -0.1898 0.0791 0.2696 -0.0755 -0.1220 0.2630 0.3649 -0.0473 -0.0834 0.5320 -0.0135 0.2023 -0.1681 -0.2032 -0.1918 -0.1265 -0.1409 -0.1874 0.0913 0.0908 0.0974 0.0877 0.0973 0.0908 0.0962 0.1961 0.1110 0.1216 0.1522 0.1608 0.1451 0.1489 0.1606 0.1603 0.1614
va: 1.0995 1.1292 1.1214 1.1213 1.0977 1.9256 2.0035 2.8686 3.2783 3.7695 3.9578 3.8793 3.8606 3.8855 3.8045 3.7571 3.8932 4.1100 3.7996 3.8892 4.4571 3.6136 4.0276 3.9184 3.9520 3.8949 3.8285 3.8325 3.8666 1.0173 1.0159 1.0142 1.0206 1.0179 1.0152 0.9986 1.0205 1.0193 1.0042 1.0051 0.9937 1.0023 1.0020 0.9890 0.9898 0.9900
dispcorr: -0.025030186 hartree
energy: -1531.684424815137
dipole: -45.01381 43.51278 -1.50103 -2.90546 2.65814 -0.24732 -5.63844 5.26575 -0.37269
magnitude: 1.56625 au
magnitude: 3.98110 debye
