program: Gaussian 09
title: 000064139
version: EM64L-G09RevD.01
frameworkgroup: C1[X(C14H9ClF3NO2)]
method: RPBEPBE
basis: SDD
operation: Freq
keyword: #p
keyword: freq=noraman
keyword: PBEPBE/SDD
title: #p freq=noraman PBEPBE/SDD
converged: YES YES NO NO
title: Mulliken charges:
elementType: Cl F F F O O N C C C C C C C C C C C C C C H H H H H H H H H
charge: -0.042516 -0.147584 -0.152104 -0.127604 -0.228590 -0.204641 -0.457020 -0.271710 -0.484108 -0.487631 -0.031833 0.039378 0.293168 0.047579 0.319612 0.387347 -0.291286 -0.388867 0.166669 -0.146981 -0.197398 0.264520 0.250385 0.258755 0.254573 0.249763 0.282717 0.340418 0.242297 0.262694
chargesum: 0.00000
title: Mulliken charges with hydrogens summed into heavy atoms:
elementType: Cl F F F O O N C C C C C C C C C C C C C C
charge: -0.042516 -0.147584 -0.152104 -0.127604 -0.228590 -0.204641 -0.116601 -0.007191 0.025032 0.016704 -0.031833 0.039378 0.293168 0.047579 0.319612 0.387347 -0.008569 -0.146570 0.166669 -0.146981 0.065296
polarizability: 2.23855375e+02 8.40436649e+00 2.19717460e+02 -9.09762779e-01 1.82168597e+01 1.00941752e+02
1716.lowfreq: -8.5386 -3.1769 -0.0016 -0.0010 -0.0007 4.9057 19.2333 32.6120 36.8931
frequency: 19.0577 32.5987 36.8599 55.2368 61.0460 78.6549 84.7027 127.8716 154.8131 160.1961 187.8358 203.9465 225.0713 267.9702 296.5527 317.9246 327.0567 343.8358 363.6005 379.0279 403.2458 446.7317 454.9637 472.6678 484.5767 512.0067 521.5267 525.8952 553.6802 606.6185 629.1810 633.5902 663.9243 697.0218 716.0624 753.1585 756.8912 796.6739 799.1926 817.6056 821.0215 861.2207 873.3321 889.9593 901.0064 909.7266 936.8099 945.2139 1029.1069 1043.4415 1049.9290 1066.3058 1067.6202 1085.5434 1088.6493 1123.2470 1137.8564 1167.7832 1171.2796 1193.8429 1203.3214 1261.3816 1271.0634 1284.6541 1360.2177 1374.1171 1404.1299 1441.6097 1452.9491 1463.1762 1486.5108 1600.3748 1614.8152 1701.2455 2280.9332 3106.8134 3113.9686 3124.6697 3142.3770 3171.7338 3177.3295 3210.9822 3228.9118 3559.8883
redmass: 3.4363 5.0721 5.0353 10.8410 10.7817 7.7983 10.5420 5.5050 4.6331 6.6089 6.2633 7.6706 11.3533 11.4631 13.0746 9.6662 11.4001 5.9508 6.2798 8.2384 8.4522 5.7910 6.2001 10.3234 6.4664 5.4931 6.2654 5.8239 4.4871 1.4813 8.8149 9.3701 6.4017 4.8416 4.5031 2.4736 6.3764 1.4172 2.4702 1.5581 4.0218 1.6749 4.6835 3.3529 3.8626 2.7858 5.5935 1.3566 9.1801 3.7085 1.1864 1.2305 2.3769 2.3459 1.3026 2.7815 2.4223 3.2075 1.3906 3.0176 2.5238 1.7251 1.7555 2.2492 3.6403 2.7860 4.7732 1.0848 2.1483 1.2570 3.3556 7.7871 7.0231 8.1448 11.8571 1.0510 1.0639 1.0872 1.0902 1.0929 1.0962 1.1185 1.1161 1.0773
irintensity: 0.4326 1.2187 2.9326 0.1103 0.3458 1.1499 0.2925 0.7478 1.0978 2.4592 1.9183 1.6548 3.1846 0.4059 1.3896 2.3628 1.2637 0.3370 1.2463 10.0613 3.9421 0.6845 7.0091 1.0976 5.3794 12.9287 13.8671 18.1505 12.8904 44.6738 8.2584 21.2786 10.9883 57.0813 3.3327 1.3076 13.1241 0.1297 8.6080 30.6316 71.8402 4.2900 63.9431 19.9360 232.1230 43.2058 73.8171 0.3103 142.3353 93.5391 15.2054 35.9630 49.5392 48.6445 0.6750 89.7884 60.3022 58.3190 0.9913 23.3622 170.0617 62.0580 2.1849 84.5480 3.6074 11.0913 9.7192 10.8915 7.9915 1.9524 213.1869 18.4783 10.7914 713.7839 240.2320 12.7991 4.9660 7.3000 7.3141 0.1415 2.6815 0.1880 14.3860 56.4777
temp: 298.150 k
press: 1.00000 atm
elementType: 17 9 9 9 8 8 7 6 6 6 6 6 6 6 6 6 6 6 6 6 6 1 1 1 1 1 1 1 1 1
symmnumber: 1
zpe: 522583.5 jmol-1
zpe.correction: 0.199042 hartree
zpe.thermalcorrener: 0.218204 hartree
zpe.thermalcorrenthalpy: 0.219149 hartree
zpe.thermalcorrgfe: 0.149041 hartree
zpe.sumelectzpe: -1502.102351 hartree
zpe.sumelectthermal: -1502.083188 hartree
zpe.sumelectthermalent: -1502.082244 hartree
zpe.sumelectthermalfe: -1502.152351 hartree
dipole: -1.2291 3.7746 -1.4946
dipole: 4.2417
quadrupole: -96.9311 -140.9267 -131.2634
quadrupole: 20.6763 1.5680 -5.2819
quadrupole: 26.1093 -17.8863 -8.2230 20.6763 1.5680 -5.2819
hfenergy: -1502.3013922 hartree
pointgroup: C01 [X(C14H9Cl1F3N1O2)]
dipole: -0.1281526 -1.5039812 0.7117423 debye
polarizability: 227.2135476|-6.7636455|218.3714931|-4.5276846|8.6949576|98.9295468 unknown
InChI: InChI=1S/C14H9ClF3NO2/c15-9-3-4-11-10(7-9)13(14(16,17)18,21-12(20)19-11)6-5-8-1-2-8/h3-4,7-8,19H,1-2H2
charge 0 multiplicity 1
30 atoms
Cl -1.992367 -4.363958 0.160479
F  0.405073 -0.336995 -2.401738
F  -0.911916 1.481713 -2.066947
F  1.342922 1.676279 -1.957671
O  0.085188 1.851465 0.592203
O  -1.233035 3.690255 1.043441
N  -2.282921 1.638008 0.703667
C  3.829088 -1.084696 1.08512
C  5.112905 -0.219473 0.967626
C  4.917799 -1.398173 0.022403
C  0.204214 0.506537 -0.092789
C  2.559774 -0.540051 0.675954
C  -1.00729 -0.381489 0.200754
C  1.474246 -0.07512 0.319398
C  -2.235107 0.237187 0.547662
C  0.269022 0.839442 -1.631971
C  -0.929957 -1.785249 0.09734
C  -3.391594 -0.553037 0.75491
C  -1.17465 2.47722 0.776784
C  -2.088249 -2.553282 0.307507
C  -3.323293 -1.953984 0.627041
H  3.783349 -1.764293 1.943022
H  5.839573 -0.309254 1.779437
H  4.993178 0.789034 0.564468
H  4.669209 -1.185145 -1.020238
H  5.509388 -2.303843 0.180356
H  0.020905 -2.261797 -0.156056
H  -3.182401 2.097497 0.854857
H  -4.34119 -0.078794 1.02609
H  -4.213264 -2.569403 0.784493
