program: Gaussian 09
title: 000064135
version: EM64L-G09RevD.01
frameworkgroup: C1[X(C10H12Cl2N6O2)]
method: RPBEPBE
basis: SDD
operation: Freq
keyword: #p
keyword: freq=noraman
keyword: PBEPBE/SDD
title: #p freq=noraman PBEPBE/SDD
converged: YES YES NO NO
title: Mulliken charges:
elementType: Cl Cl O O N N N N N N C C C C C C C C C C H H H H H H H H H H H H
charge: 0.014975 0.015268 -0.294871 -0.265641 -0.233695 -0.157047 -0.220023 -0.050604 -0.386674 0.096287 0.167346 0.112832 0.167453 0.187256 0.209009 -0.676269 -0.612843 -0.600329 -0.108255 -0.612609 0.238887 0.319986 0.237334 0.271483 0.249106 0.249105 0.268133 0.251038 0.250945 0.313783 0.250970 0.347665
chargesum: 0.00000
title: Mulliken charges with hydrogens summed into heavy atoms:
elementType: Cl Cl O O N N N N N N C C C C C C C C C C
charge: 0.014975 0.015268 -0.294871 -0.265641 -0.233695 -0.157047 -0.220023 -0.050604 -0.072891 0.096287 0.167346 0.112832 0.167453 0.187256 0.209009 0.119938 0.156850 0.169786 0.142715 -0.264944
polarizability: 3.63424118e+02 -3.30212433e+00 1.76374718e+02 1.06749801e-01 -4.87646929e-02 1.11843176e+02
1716.lowfreq: -5.1655 -0.0025 -0.0023 -0.0013 2.9520 3.4821 14.8148 20.6711 41.9484
frequency: 14.6123 20.4917 41.9476 61.9042 77.8995 84.5133 104.5573 106.1526 127.0700 146.5658 154.6458 165.9909 172.2561 202.7265 229.5396 234.4184 251.2872 269.6100 290.9887 318.6780 344.0550 365.5096 378.1494 378.6193 389.4593 396.9541 440.6686 474.1325 501.0212 581.0585 597.0339 621.4152 629.1073 642.0437 686.0805 703.1498 706.9652 729.0987 733.6619 766.4826 858.4872 914.1276 956.1712 962.7001 1020.1619 1049.9870 1079.4398 1124.7509 1129.8269 1132.3362 1149.9193 1180.9991 1187.3174 1198.9584 1208.9664 1219.1432 1227.1338 1262.0861 1299.7291 1310.7051 1359.2163 1387.2110 1413.9116 1427.7527 1453.5911 1466.6953 1472.0299 1472.3503 1478.1786 1478.7632 1488.5730 1498.8824 1512.1097 1564.1173 1575.8720 1596.1401 1623.3708 1647.9555 2973.9890 3009.7269 3012.4009 3039.7997 3063.5123 3095.7131 3099.8204 3104.3056 3138.6639 3141.4836 3161.1704 3403.6172
redmass: 11.3236 8.8376 8.2381 5.5528 1.2605 2.1724 1.6843 2.0440 3.2479 7.0596 14.4528 6.1034 1.1483 2.5720 4.6161 3.4362 5.9417 11.7736 2.9205 6.6004 3.5908 6.8307 8.3877 7.6533 6.0036 7.3277 7.0610 8.0199 5.6434 1.3505 8.4657 5.5155 7.3527 8.9036 11.1547 11.2269 5.4192 6.2236 11.1103 4.9658 5.7360 1.5537 6.5433 2.9507 3.1486 3.1543 3.2800 1.2972 1.3022 1.3003 2.7902 2.7847 1.0668 3.3329 1.3622 3.7467 2.6737 5.3062 5.8404 2.0185 2.4344 2.8629 1.3020 1.2516 2.0942 1.4988 1.1979 1.0581 1.0418 1.0783 1.3212 1.0440 3.1465 3.5649 6.6647 6.0742 8.6869 9.5269 1.0340 1.0335 1.0327 1.0893 1.1031 1.1009 1.1026 1.1022 1.1024 1.1014 1.0894 1.0745
irintensity: 0.0131 1.3799 1.1404 0.5688 0.1041 0.5893 0.4255 1.3320 13.1462 0.8965 6.3132 19.8055 1.5717 44.0549 0.6828 4.3500 1.7594 0.3032 1.2633 0.6800 12.6267 0.7084 19.4773 13.2162 11.2406 3.1147 9.8134 22.6636 7.4274 96.3152 4.4021 63.2855 103.9849 1.7801 0.9243 5.9342 135.9452 8.6187 19.2931 4.9983 3.1562 65.1903 36.3651 3.3065 175.8396 15.0238 174.7132 0.1264 0.2929 0.1326 217.0800 39.8148 7.3405 4.4521 13.4962 20.4597 2.7832 28.1875 35.7187 39.9630 14.8056 6.6320 3.9652 54.2473 272.6104 134.0370 93.1770 25.3573 17.4491 1.2490 265.2746 21.7352 18.4528 293.3376 278.9811 515.2971 346.1890 537.1002 50.4101 28.5738 32.8680 18.7602 20.6397 5.3306 15.9941 17.4095 0.9088 0.4906 0.4180 2.3202
temp: 298.150 k
press: 1.00000 atm
elementType: 17 17 8 8 7 7 7 7 7 7 6 6 6 6 6 6 6 6 6 6 1 1 1 1 1 1 1 1 1 1 1 1
symmnumber: 1
zpe: 602764.7 jmol-1
zpe.correction: 0.229581 hartree
zpe.thermalcorrener: 0.250168 hartree
zpe.thermalcorrenthalpy: 0.251112 hartree
zpe.thermalcorrgfe: 0.177281 hartree
zpe.sumelectzpe: -1785.858071 hartree
zpe.sumelectthermal: -1785.837484 hartree
zpe.sumelectthermalent: -1785.836540 hartree
zpe.sumelectthermalfe: -1785.910370 hartree
dipole: 1.4929 3.6130 0.0543
dipole: 3.9096
quadrupole: -164.5577 -124.6616 -132.0081
quadrupole: 4.9912 0.0629 0.2417
quadrupole: -24.1486 15.7476 8.4010 4.9912 0.0629 0.2417
hfenergy: -1786.0876517 hartree
pointgroup: C01 [X(C10H12Cl2N6O2)]
dipole: -0.667912 -1.3855592 0.0098041 debye
polarizability: 362.426828|-13.992139|177.3617818|-0.9124163|0.7233442|111.8534023 unknown
InChI: InChI=1S/C10H12Cl2N6O2/c1-16-6-7(14-9(16)15-13-4-5(11)12)17(2)10(20)18(3)8(6)19/h4-5,15H,1-3H3
charge 0 multiplicity 1
32 atoms
Cl -6.450824 0.782006 1.55655
Cl -6.491035 0.714831 -1.503591
O  3.117164 -2.523386 -0.016048
O  4.35455 2.03244 -0.008774
N  0.171801 -1.481011 -0.001733
N  2.058416 1.543212 -0.001014
N  3.711131 -0.222139 -0.012325
N  -0.287462 0.774567 0.008502
N  -2.15007 -0.82194 0.013787
N  -3.105488 0.158221 0.002211
C  1.410784 -0.803434 -0.005341
C  1.083442 0.560708 0.000192
C  2.756519 -1.300364 -0.011589
C  -0.799397 -0.483273 0.006579
C  3.427216 1.174163 -0.007532
C  -0.015174 -2.941065 -0.009611
C  1.683249 2.971242 0.005078
C  5.149645 -0.575455 -0.01852
C  -4.368347 -0.20517 0.020159
C  -5.379518 0.878065 0.008799
H  -0.561895 -3.265889 -0.914069
H  0.985501 -3.402529 -0.016709
H  -0.552295 -3.277656 0.896533
H  2.612824 3.558355 0.003452
H  1.086601 3.200736 0.903521
H  1.079862 3.206623 -0.887327
H  5.216502 -1.673124 -0.018133
H  5.645557 -0.156145 0.872005
H  5.637841 -0.157681 -0.914075
H  -2.406215 -1.819315 0.03594
H  -4.733167 -1.247252 0.044762
H  -4.940219 1.881155 -0.018477
