program: Orca
programVersion: 5.0.4
elementType: F F F F F O O N N C C C C C C C C C C C C C C C C C C C C H H H H H H H H H H H H H H H H H
charge: 0
multiplicity: 1
keywords: wb97x-d3
keywords: def2-TZVPP
keywords: def2/J RIJCOSX
keywords: DEFGRID2
keywords: scfconv7
keywords: smallprint printgap noloewdin
keywords: NOSOSCF
formula: C20H17F5N2O2
InChI: InChI=1/C20H17F5N2O2/c21-15-9-8-14(20(23,24)25)17(18(15)22)19(27-29-11-13-6-7-13)26-16(28)10-12-4-2-1-3-5-12/h1-5,8-9,13,26H,6-7,10-11H2
46 atoms
F  2.628284 1.126104 2.028048
F  -0.161442 -0.787263 -1.664175
F  1.283399 -1.676984 -2.977088
F  0.654602 -2.728963 -1.216409
F  5.150422 0.882193 1.141993
O  -1.160902 -0.751296 2.133493
O  1.117238 2.326123 -0.670441
N  0.028463 -1.028884 1.511627
N  -0.220333 1.169676 0.762081
C  -2.655536 -2.434331 1.224795
C  -2.061582 -3.484384 0.33827
C  -3.189997 -3.833519 1.256239
C  -1.903026 -1.92985 2.41831
C  0.465002 -0.019642 0.867411
C  1.811388 -0.166702 0.258526
C  2.073427 -0.877257 -0.912215
C  2.869698 0.416704 0.92658
C  0.080272 2.23078 -0.052159
C  -1.0117 3.280275 -0.098038
C  3.379307 -1.009108 -1.365599
C  0.961191 -1.515574 -1.691037
C  -2.355367 2.680464 -0.421531
C  4.166318 0.293426 0.467017
C  4.430066 -0.427551 -0.676159
C  -2.577124 2.116305 -1.677072
C  -3.370131 2.627969 0.528513
C  -3.785902 1.50585 -1.971788
C  -4.582088 2.014143 0.23533
C  -4.79111 1.448573 -1.013528
H  -3.288852 -1.692704 0.747146
H  -1.078636 -3.860826 0.590934
H  -2.261893 -3.427316 -0.723855
H  -2.968355 -4.444316 2.123795
H  -4.16937 -4.009724 0.830346
H  -1.244284 -2.702659 2.828535
H  -2.594219 -1.627781 3.207822
H  -1.119302 1.183338 1.226644
H  -0.721599 4.021627 -0.842333
H  -1.045031 3.787874 0.870337
H  3.601291 -1.562895 -2.266595
H  5.44719 -0.527218 -1.030852
H  -1.796113 2.153092 -2.428245
H  -3.211383 3.064592 1.507795
H  -3.943711 1.070873 -2.950445
H  -5.361191 1.977863 0.986151
H  -5.733528 0.967943 -1.242682
elementType: F O N C H
totalener: -1531.66964286 hartree
nucrepener: 2983.61012886 hartree
electener: -4515.27977172 hartree
oneelecener: -8037.52822510 hartree
twoeener: 3522.24845338 hartree
cpcmener: -0.02930363 hartree
kineticenergy: 1525.78219533 hartree
xcener: -138.186383098852 hartree
chargesum: -0.0000000
charge: -0.200566 -0.180528 -0.175575 -0.174476 -0.198009 -0.266209 -0.453772 -0.160417 -0.174751 -0.064011 -0.178999 -0.205358 0.056591 0.255748 -0.075453 -0.091596 0.258377 0.347938 -0.066789 -0.103113 0.548780 0.007330 0.197342 -0.167810 -0.212170 -0.197005 -0.131586 -0.137389 -0.171563 0.082957 0.079353 0.094644 0.087833 0.094357 0.086697 0.101092 0.186405 0.106503 0.124225 0.149029 0.157355 0.143460 0.146263 0.158552 0.157862 0.158456
qa: -0.2006 -0.1805 -0.1756 -0.1745 -0.1980 -0.2662 -0.4538 -0.1604 -0.1748 -0.0640 -0.1790 -0.2054 0.0566 0.2557 -0.0755 -0.0916 0.2584 0.3479 -0.0668 -0.1031 0.5488 0.0073 0.1973 -0.1678 -0.2122 -0.1970 -0.1316 -0.1374 -0.1716 0.0830 0.0794 0.0946 0.0878 0.0944 0.0867 0.1011 0.1864 0.1065 0.1242 0.1490 0.1574 0.1435 0.1463 0.1586 0.1579 0.1585
va: 1.1039 1.1129 1.1291 1.1195 1.0993 1.9357 2.0474 2.9064 3.2610 3.7673 3.8796 3.9527 3.8685 3.9697 3.7797 3.7351 3.8966 4.1133 3.7786 3.9280 4.4106 3.6048 4.0339 3.9164 3.9322 3.9175 3.8726 3.8790 3.9003 1.0151 1.0289 1.0195 1.0152 1.0162 1.0153 0.9985 1.0296 1.0227 1.0058 1.0066 0.9949 1.0073 1.0024 0.9899 0.9901 0.9901
dispcorr: -0.025199940 hartree
energy: -1531.694842803414
dipole: -38.44426 37.11888 -1.32539 -2.19563 2.16764 -0.02799 5.98487 -5.83940 0.14547
magnitude: 1.33364 au
magnitude: 3.38985 debye
