program: Orca
programVersion: 5.0.4
elementType: F F F F F O O N N C C C C C C C C C C C C C C C C C C C C H H H H H H H H H H H H H H H H H
charge: 0
multiplicity: 1
keywords: wb97x-d3
keywords: def2-TZVPP
keywords: def2/J RIJCOSX
keywords: DEFGRID2
keywords: scfconv7
keywords: smallprint printgap noloewdin
keywords: NOSOSCF
formula: C20H17F5N2O2
InChI: InChI=1/C20H17F5N2O2/c21-15-9-8-14(20(23,24)25)17(18(15)22)19(27-29-11-13-6-7-13)26-16(28)10-12-4-2-1-3-5-12/h1-5,8-9,13,26H,6-7,10-11H2
46 atoms
F  1.901641 0.353079 2.363716
F  0.290983 -0.277191 -2.664338
F  2.000794 -1.408511 -3.302161
F  0.661346 -2.231607 -1.844422
F  4.273111 1.399208 1.756151
O  -0.839458 -2.513293 1.699235
O  -0.181207 1.727352 -0.091683
N  0.378883 -2.050802 1.297596
N  -0.900743 -0.40183 0.230011
C  -2.0612 -4.215342 2.776105
C  -2.146103 -5.145095 3.946943
C  -2.55802 -3.714812 4.097912
C  -0.708386 -3.801001 2.296456
C  0.291595 -0.987624 0.604989
C  1.581321 -0.39842 0.163891
C  2.071667 -0.47095 -1.144256
C  2.351547 0.237062 1.11681
C  -1.080168 0.91722 -0.096067
C  -2.514305 1.255594 -0.440289
C  3.301273 0.088377 -1.458221
C  1.258969 -1.101808 -2.236381
C  -2.660305 2.638346 -0.999579
C  3.578769 0.790692 0.798146
C  4.062359 0.719706 -0.486781
C  -3.128721 3.682241 -0.20945
C  -2.311531 2.901058 -2.322189
C  -3.255914 4.963543 -0.730946
C  -2.435704 4.179162 -2.845934
C  -2.910382 5.215201 -2.050787
H  -2.803466 -4.356341 1.99701
H  -1.221728 -5.461854 4.414869
H  -2.917463 -5.904011 3.931562
H  -1.910475 -3.056975 4.665449
H  -3.612928 -3.491318 4.192618
H  -0.317927 -4.511639 1.560594
H  0.000444 -3.755129 3.13023
H  -1.728915 -0.978565 0.311799
H  -3.10962 1.144267 0.471603
H  -2.895465 0.508053 -1.141962
H  3.692431 0.04094 -2.464075
H  5.022623 1.153429 -0.731829
H  -3.40085 3.493219 0.822481
H  -1.940969 2.097757 -2.948906
H  -3.625506 5.765274 -0.104157
H  -2.162732 4.367498 -3.876566
H  -3.010911 6.212736 -2.45929
elementType: F O N C H
totalener: -1531.67145430 hartree
nucrepener: 2853.03766160 hartree
electener: -4384.70911590 hartree
oneelecener: -7776.40958260 hartree
twoeener: 3391.70046670 hartree
cpcmener: -0.03482709 hartree
kineticenergy: 1525.77978932 hartree
xcener: -138.184887732346 hartree
chargesum: 0.0000000
charge: -0.196601 -0.171763 -0.173630 -0.173613 -0.197480 -0.252416 -0.454595 -0.161470 -0.163244 -0.088049 -0.198448 -0.170331 0.066001 0.247468 -0.081146 -0.090348 0.249005 0.315005 -0.048335 -0.093627 0.530258 0.022008 0.200318 -0.163567 -0.185524 -0.215620 -0.159538 -0.148212 -0.162463 0.094269 0.088691 0.095839 0.086793 0.094217 0.084019 0.079952 0.178438 0.131920 0.130377 0.150503 0.158226 0.137729 0.138984 0.156546 0.156058 0.157395
qa: -0.1966 -0.1718 -0.1736 -0.1736 -0.1975 -0.2524 -0.4546 -0.1615 -0.1632 -0.0880 -0.1984 -0.1703 0.0660 0.2475 -0.0811 -0.0903 0.2490 0.3150 -0.0483 -0.0936 0.5303 0.0220 0.2003 -0.1636 -0.1855 -0.2156 -0.1595 -0.1482 -0.1625 0.0943 0.0887 0.0958 0.0868 0.0942 0.0840 0.0800 0.1784 0.1319 0.1304 0.1505 0.1582 0.1377 0.1390 0.1565 0.1561 0.1574
va: 1.1115 1.1157 1.1323 1.1294 1.0991 1.9553 2.0407 2.9089 3.2570 3.8517 3.9311 3.8865 3.8948 3.9673 3.7843 3.7108 3.9215 4.1400 3.7204 3.9058 4.4454 3.5923 4.0174 3.9078 3.9639 3.9704 3.9015 3.8926 3.8964 1.0107 1.0159 1.0162 1.0172 1.0167 1.0042 0.9999 1.0284 1.0061 1.0067 1.0059 0.9947 1.0058 1.0091 0.9914 0.9913 0.9903
dispcorr: -0.021614013 hartree
energy: -1531.693068313831
dipole: -33.15190 32.07289 -1.07901 -4.28814 3.29451 -0.99363 14.54443 -14.84773 -0.30330
magnitude: 1.49785 au
magnitude: 3.80723 debye
