program: Orca
programVersion: 5.0.4
elementType: F F F F F O O N N C C C C C C C C C C C C C C C C C C C C H H H H H H H H H H H H H H H H H
charge: 0
multiplicity: 1
keywords: wb97x-d3
keywords: def2-TZVPP
keywords: def2/J RIJCOSX
keywords: DEFGRID2
keywords: scfconv7
keywords: smallprint printgap noloewdin
keywords: NOSOSCF
formula: C20H17F5N2O2
InChI: InChI=1/C20H17F5N2O2/c21-15-9-8-14(20(23,24)25)17(18(15)22)19(27-29-11-13-6-7-13)26-16(28)10-12-4-2-1-3-5-12/h1-5,8-9,13,26H,6-7,10-11H2
46 atoms
F  2.020946 0.555125 2.327935
F  1.462593 -1.037563 -3.358951
F  1.102777 -2.52494 -1.851158
F  -0.196466 -0.820705 -2.014771
F  4.388686 1.503393 1.512536
O  -0.812575 -2.509328 1.676039
O  -0.080698 1.884368 -0.001429
N  0.372925 -2.04418 1.183491
N  -0.873079 -0.110472 0.742552
C  -2.026091 -4.369969 2.473575
C  -2.101725 -5.447606 3.511212
C  -2.543238 -4.058119 3.844853
C  -0.677416 -3.875197 2.062072
C  0.288683 -0.852389 0.746404
C  1.552773 -0.293466 0.197006
C  1.95502 -0.454764 -1.13078
C  2.392482 0.375386 1.061881
C  -1.016444 1.178746 0.301373
C  -2.455758 1.644643 0.247218
C  3.173239 0.053861 -1.55597
C  1.083729 -1.208051 -2.091243
C  -2.630627 2.807308 -0.684636
C  3.610011 0.874368 0.636557
C  4.005801 0.721958 -0.67205
C  -2.857943 4.089996 -0.200382
C  -2.547722 2.612979 -2.062052
C  -3.004203 5.161121 -1.073401
C  -2.690322 3.679739 -2.935786
C  -2.919152 4.958944 -2.442942
H  -2.759521 -4.418697 1.675127
H  -1.173887 -5.804479 3.94201
H  -2.856443 -6.213671 3.38916
H  -1.916224 -3.468425 4.502952
H  -3.60375 -3.87007 3.954332
H  -0.289178 -4.45793 1.221076
H  0.036093 -3.959832 2.888963
H  -1.712517 -0.606456 1.012631
H  -2.751795 1.918239 1.264838
H  -3.103288 0.814252 -0.045458
H  3.497903 -0.061825 -2.579859
H  4.95729 1.118926 -0.999595
H  -2.923396 4.255329 0.868615
H  -2.366333 1.618316 -2.454047
H  -3.183438 6.154149 -0.681141
H  -2.621634 3.513938 -4.003518
H  -3.030877 5.792249 -3.124886
elementType: F O N C H
totalener: -1531.67120908 hartree
nucrepener: 2858.57140535 hartree
electener: -4390.24261443 hartree
oneelecener: -7787.52031272 hartree
twoeener: 3397.27769829 hartree
cpcmener: -0.03385803 hartree
kineticenergy: 1525.78783718 hartree
xcener: -138.186722821575 hartree
chargesum: -0.0000000
charge: -0.199073 -0.173976 -0.172447 -0.179097 -0.197878 -0.253790 -0.456365 -0.167058 -0.158410 -0.095519 -0.196906 -0.168545 0.066839 0.253503 -0.095476 -0.099604 0.285335 0.322396 -0.050675 -0.103517 0.544895 0.013243 0.182202 -0.157202 -0.172262 -0.210637 -0.160811 -0.147765 -0.161306 0.094363 0.088273 0.096343 0.087016 0.094120 0.085535 0.078553 0.175682 0.127507 0.124214 0.151078 0.158027 0.138182 0.140600 0.156325 0.156421 0.157670
qa: -0.1991 -0.1740 -0.1724 -0.1791 -0.1979 -0.2538 -0.4564 -0.1671 -0.1584 -0.0955 -0.1969 -0.1685 0.0668 0.2535 -0.0955 -0.0996 0.2853 0.3224 -0.0507 -0.1035 0.5449 0.0132 0.1822 -0.1572 -0.1723 -0.2106 -0.1608 -0.1478 -0.1613 0.0944 0.0883 0.0963 0.0870 0.0941 0.0855 0.0786 0.1757 0.1275 0.1242 0.1511 0.1580 0.1382 0.1406 0.1563 0.1564 0.1577
va: 1.1069 1.1317 1.1246 1.1167 1.0989 1.9542 2.0386 2.9132 3.2802 3.8607 3.9314 3.8819 3.8929 3.9530 3.8090 3.7260 3.8915 4.1328 3.7467 3.9130 4.4306 3.6149 4.0344 3.9010 3.9511 3.9604 3.9036 3.8885 3.8955 1.0111 1.0161 1.0162 1.0174 1.0167 1.0064 0.9988 1.0317 1.0071 1.0095 1.0052 0.9947 1.0053 1.0072 0.9915 0.9911 0.9901
dispcorr: -0.021633788 hartree
energy: -1531.692842873332
dipole: -32.53337 31.38959 -1.14378 -5.04651 4.33085 -0.71566 13.24490 -13.15679 0.08811
magnitude: 1.35210 au
magnitude: 3.43675 debye
