program: Gaussian 09
title: 000064170
version: EM64L-G09RevD.01
frameworkgroup: C1[X(C17H26O4)]
method: RPBEPBE
basis: SDD
operation: Freq
keyword: #pfreq=noraman
keyword: PBEPBE/SDD
title: #p freq=noraman PBEPBE/SDD
converged: NO YES NO NO
title: Mulliken charges:
elementType: O O O O C C C C C C C C C C C C C C C C C H H H H H H H H H H H H H H H H H H H H H H H H H H
charge: -0.294955 -0.251493 -0.413804 -0.239725 0.452225 -0.103530 -0.111465 -0.107664 -0.552780 -0.529787 -0.548801 -0.451842 -0.454249 -0.450817 -0.085717 -0.437809 -0.700259 0.271971 -0.527500 -0.476852 0.192305 0.197477 0.197134 0.197713 0.200576 0.206109 0.211010 0.210079 0.225685 0.198731 0.195241 0.197797 0.198461 0.191570 0.196116 0.193282 0.247960 0.226313 0.211826 0.217648 0.218797 0.226079 0.256379 0.275748 0.287609 0.259265 0.377945
chargesum: 0.00000
title: Mulliken charges with hydrogens summed into heavy atoms:
elementType: O O O O C C C C C C C C C C C C C C C C C
charge: -0.294955 -0.251493 -0.035858 -0.239725 0.452225 0.093947 0.085668 0.090049 -0.146095 -0.108698 -0.124385 -0.058804 -0.064218 -0.061419 0.162243 0.000330 -0.037736 0.271971 0.004627 0.070021 0.192305
polarizability: 2.18242718e+02 2.91325891e+00 1.74917775e+02 -1.62512806e-01 5.00807238e+00 1.60802652e+02
1716.lowfreq: -11.4633 -0.0006 0.0004 0.0006 5.1901 14.8858 17.6664 22.5828 36.7053
frequency: 13.3884 22.5369 35.1858 42.4200 61.1619 72.8059 80.3734 103.0887 128.4751 147.4487 179.0876 210.3049 229.7379 257.6863 268.5736 295.1418 301.1882 325.9801 337.6202 390.0057 396.9629 410.6676 421.6883 433.7445 445.2539 457.2811 494.6606 522.1663 556.9171 586.3399 626.4470 639.2842 643.6913 649.0125 672.1741 725.7298 747.7520 772.4293 791.5869 806.6585 810.6140 849.0802 867.7837 871.1939 874.5692 875.4391 895.1159 927.4771 933.1305 943.0647 952.3233 969.3500 972.6029 982.6106 1017.1409 1044.3431 1047.3997 1049.8960 1051.3640 1053.7063 1077.7834 1094.0703 1095.7035 1102.3708 1105.6359 1108.4302 1114.0343 1123.6817 1140.3891 1152.7537 1166.8006 1185.7217 1189.6573 1237.4243 1246.4813 1257.2304 1257.6403 1267.7320 1284.9006 1287.8655 1294.6176 1302.4252 1309.7211 1313.8793 1315.5038 1318.2070 1324.9480 1332.8879 1342.2497 1343.2707 1355.3950 1357.2783 1360.9653 1372.2379 1380.7674 1391.7407 1441.7563 1452.2584 1452.5082 1454.7921 1457.2768 1464.6739 1465.3064 1468.6725 1473.4881 1486.5588 1487.0412 1631.2874 1664.8660 2958.5985 2960.7627 2962.3941 2963.3894 2964.4990 2969.3252 2983.3135 2991.5813 2992.4516 2994.4302 2999.4064 3000.4374 3004.5828 3006.4941 3017.3930 3018.8149 3022.8687 3027.4266 3030.6645 3035.7305 3051.7594 3062.5574 3079.3552 3082.3287 3086.8068 3512.0525
redmass: 5.3252 7.2785 4.5620 6.4463 3.3665 2.1043 3.3646 2.5696 3.3231 2.6569 3.8401 1.8151 2.2896 3.9557 5.7342 2.0240 3.3154 2.4594 2.5772 4.4444 4.5425 2.4024 1.8851 2.3178 1.8877 2.5889 2.3823 2.2450 3.6691 3.7983 4.1455 3.8526 3.8097 1.4242 4.8139 3.7621 1.9208 3.1434 1.6727 2.7083 2.7320 2.3059 2.9423 1.7181 1.6066 1.5610 3.0116 4.0092 2.4007 2.0220 2.1708 2.1696 2.1159 2.6121 2.1762 1.9168 2.0153 2.0230 2.2645 2.2243 1.9393 1.9852 2.1031 1.5094 1.2247 1.0729 1.0393 1.6537 2.2044 2.4205 1.4980 1.2398 1.2689 1.3151 1.4808 1.3483 1.4597 1.4033 1.7615 1.7697 1.7791 1.9569 1.5996 1.5773 1.4253 1.4625 1.3164 1.6152 1.4387 1.4447 1.4878 1.4835 1.5604 1.5422 2.0154 1.2158 1.0757 1.0817 1.0935 1.0825 1.0800 1.0913 1.0896 1.0909 1.0476 1.0633 1.0778 9.6584 8.1463 1.0615 1.0629 1.0616 1.0614 1.0607 1.0622 1.0359 1.0834 1.0829 1.0772 1.0686 1.0648 1.0830 1.0644 1.1022 1.1029 1.1004 1.1021 1.1005 1.1003 1.0995 1.0940 1.0996 1.0973 1.1005 1.0639
irintensity: 0.0621 0.5842 0.6400 1.3264 0.8065 0.3122 2.0479 0.8562 2.2088 1.0236 1.2671 4.2268 6.1089 0.8727 2.2478 0.2798 2.9981 0.6807 2.7161 4.6211 0.0480 7.1367 2.0457 8.7476 6.0972 1.4383 19.4389 24.0815 48.9326 17.4871 6.5122 0.4917 0.0185 120.2574 0.7222 0.0360 1.6046 0.6248 15.2407 5.9812 2.5341 16.5841 27.5762 2.3343 0.8121 0.0418 47.2264 56.7673 6.3957 5.6061 5.7714 4.3338 15.8115 14.4338 45.3171 0.2585 16.5189 64.9022 66.7326 5.6135 32.7753 67.2258 58.5365 2.0345 1.6238 0.6429 0.6073 16.2769 243.3032 7.0060 74.0177 1.9280 1.1105 65.8247 1.2112 8.4815 0.3050 2.0266 0.1302 0.8383 1.1262 19.2865 5.2103 4.6938 57.1021 3.3796 0.4750 113.4078 1.4413 2.2642 2.5267 5.0389 0.5872 1.6861 8.3318 11.8638 10.5634 1.2560 57.6286 0.2754 4.2523 15.3930 16.5319 15.7892 11.0528 10.8101 1.8120 172.6812 189.0210 19.2479 20.5462 28.0078 16.1747 23.9926 71.5011 34.1864 139.0011 149.3270 20.7305 13.9593 2.7839 48.9992 22.8771 1.5066 3.3809 31.5879 104.5324 46.1023 64.6373 4.9824 3.0440 43.2713 8.7887 49.9197 24.9499
temp: 298.150 k
press: 1.00000 atm
elementType: 8 8 8 8 6 6 6 6 6 6 6 6 6 6 6 6 6 6 6 6 6 1 1 1 1 1 1 1 1 1 1 1 1 1 1 1 1 1 1 1 1 1 1 1 1 1 1
symmnumber: 1
zpe: 1060987.0 jmol-1
zpe.correction: 0.404109 hartree
zpe.thermalcorrener: 0.424571 hartree
zpe.thermalcorrenthalpy: 0.425515 hartree
zpe.thermalcorrgfe: 0.352385 hartree
zpe.sumelectzpe: -962.702669 hartree
zpe.sumelectthermal: -962.682207 hartree
zpe.sumelectthermalent: -962.681263 hartree
zpe.sumelectthermalfe: -962.754393 hartree
dipole: 1.8029 -0.7027 0.5348
dipole: 2.0075
quadrupole: -120.9754 -122.8373 -134.4244
quadrupole: 8.3197 1.1325 -1.1356
quadrupole: 5.1036 3.2417 -8.3454 8.3197 1.1325 -1.1356
hfenergy: -963.1067776 hartree
pointgroup: C01 [X(C17H26O4)]
dipole: 0.7243924 -0.2938118 0.1129631 debye
polarizability: 217.3447391|5.3658045|168.5659556|4.0355111|9.1048333|168.0524511 unknown
InChI: InChI=1S/C17H26O4/c1-2-14(21-16(20)4-3-15(18)19)17-8-11-5-12(9-17)7-13(6-11)10-17/h11-14,18H,2-10H2,1H3
charge 0 multiplicity 1
47 atoms
O  -0.854347 0.497504 0.631185
O  -1.902332 1.258804 -1.318512
O  -6.014735 -1.871384 -1.540156
O  -5.806614 -1.049896 0.620164
C  1.589006 0.489955 0.223649
C  4.091922 0.48441 -0.302912
C  2.608658 -1.31979 -1.277743
C  3.114465 -1.306746 1.20493
C  2.845957 1.376918 -0.048166
C  1.366605 -0.427418 -1.019888
C  1.871623 -0.410987 1.46217
C  3.845724 -0.419995 -1.539074
C  4.351604 -0.40503 0.943851
C  2.865787 -2.211246 -0.032506
C  0.342152 1.400077 0.419063
C  0.361339 2.366115 1.617222
C  -0.86863 3.297888 1.660422
C  -1.895405 0.542881 -0.288371
C  -3.025073 -0.374383 0.156947
C  -3.965194 -0.730651 -1.006518
C  -5.315826 -1.21097 -0.519666
H  4.969979 1.135325 -0.485613
H  2.419296 -1.959472 -2.162462
H  3.297338 -1.938485 2.096829
H  3.047457 2.035596 0.819155
H  2.662738 2.031701 -0.925468
H  1.153814 0.199572 -1.909957
H  0.478853 -1.067237 -0.851383
H  0.982379 -1.035043 1.675067
H  2.054284 0.215842 2.357925
H  3.67829 0.203425 -2.440621
H  4.739078 -1.046453 -1.735147
H  5.252026 -1.030717 0.780685
H  4.551567 0.231524 1.829819
H  3.743311 -2.86563 -0.207267
H  1.993466 -2.870943 0.148786
H  0.154995 1.962088 -0.518816
H  0.423172 1.786767 2.557111
H  1.2803 2.978941 1.553299
H  -0.796825 4.004336 2.506998
H  -0.957564 3.888034 0.729554
H  -1.800903 2.718992 1.785059
H  -2.599005 -1.272399 0.635659
H  -3.600606 0.144042 0.948865
H  -4.12295 0.165351 -1.639234
H  -3.52996 -1.493375 -1.675008
H  -6.911614 -2.140242 -1.200629
