program: Orca
programVersion: 5.0.4
elementType: F F F F F O O N N C C C C C C C C C C C C C C C C C C C C H H H H H H H H H H H H H H H H H
charge: 0
multiplicity: 1
keywords: wb97x-d3
keywords: def2-TZVPP
keywords: def2/J RIJCOSX
keywords: DEFGRID2
keywords: scfconv7
keywords: smallprint printgap noloewdin
keywords: NOSOSCF
formula: C20H17F5N2O2
InChI: InChI=1/C20H17F5N2O2/c21-15-9-8-14(20(23,24)25)17(18(15)22)19(27-29-11-13-6-7-13)26-16(28)10-12-4-2-1-3-5-12/h1-5,8-9,13,26H,6-7,10-11H2
46 atoms
F  0.713191 1.049314 1.86982
F  1.798496 -3.106748 -1.402007
F  0.466872 -1.693267 -2.335616
F  2.514752 -1.825091 -2.962948
F  3.180043 2.069736 1.806711
O  -1.447708 -2.680505 0.783563
O  -0.378231 1.414162 -1.266855
N  -0.186297 -2.182926 0.643467
N  -1.288548 -0.19923 0.041934
C  -0.954114 -4.158845 2.659822
C  -1.958871 -3.976541 3.754934
C  -1.433798 -5.34294 3.441175
C  -1.383195 -4.033052 1.229967
C  -0.165561 -0.976809 0.241523
C  1.186509 -0.389265 0.078319
C  2.104996 -0.825706 -0.878174
C  1.578414 0.597418 0.96169
C  -1.330937 0.973773 -0.662745
C  -2.678925 1.659474 -0.640265
C  3.385283 -0.291861 -0.908895
C  1.718124 -1.864098 -1.891007
C  -2.539688 3.148597 -0.770866
C  2.852661 1.129424 0.924623
C  3.766224 0.685324 -0.003848
C  -2.027007 3.891766 0.290519
C  -2.896736 3.807384 -1.94118
C  -1.877358 5.265811 0.183817
C  -2.751587 5.185157 -2.050084
C  -2.240747 5.917402 -0.988603
H  0.057759 -3.825278 2.865557
H  -2.98106 -3.749067 3.476013
H  -1.632108 -3.500304 4.670671
H  -2.097721 -6.04301 2.947543
H  -0.744548 -5.803663 4.136989
H  -2.396001 -4.41816 1.0954
H  -0.719949 -4.600084 0.569731
H  -2.147475 -0.531434 0.458094
H  -3.221107 1.401077 0.271894
H  -3.263167 1.253325 -1.471465
H  4.107635 -0.62233 -1.641319
H  4.763397 1.103403 -0.026445
H  -1.739033 3.389986 1.207878
H  -3.295217 3.241237 -2.774876
H  -1.475375 5.829758 1.016067
H  -3.037772 5.684983 -2.966859
H  -2.125503 6.990519 -1.072446
elementType: F O N C H
totalener: -1531.67145563 hartree
nucrepener: 2868.92806022 hartree
electener: -4400.59951585 hartree
oneelecener: -7808.51520690 hartree
twoeener: 3407.91569105 hartree
cpcmener: -0.03468153 hartree
kineticenergy: 1525.79555996 hartree
xcener: -138.189043402272 hartree
chargesum: -0.0000000
charge: -0.203566 -0.172510 -0.178111 -0.176698 -0.198360 -0.255528 -0.457632 -0.173232 -0.166872 -0.089389 -0.180069 -0.189244 0.068657 0.286421 -0.066751 -0.126550 0.265975 0.318991 -0.058885 -0.083586 0.534284 0.010353 0.204943 -0.173667 -0.205204 -0.167313 -0.153542 -0.161179 -0.157786 0.089466 0.084352 0.094097 0.087244 0.093866 0.093026 0.085975 0.176591 0.122579 0.121902 0.149128 0.157034 0.141529 0.138724 0.156742 0.156377 0.157414
qa: -0.2036 -0.1725 -0.1781 -0.1767 -0.1984 -0.2555 -0.4576 -0.1732 -0.1669 -0.0894 -0.1801 -0.1892 0.0687 0.2864 -0.0668 -0.1265 0.2660 0.3190 -0.0589 -0.0836 0.5343 0.0104 0.2049 -0.1737 -0.2052 -0.1673 -0.1535 -0.1612 -0.1578 0.0895 0.0844 0.0941 0.0872 0.0939 0.0930 0.0860 0.1766 0.1226 0.1219 0.1491 0.1570 0.1415 0.1387 0.1567 0.1564 0.1574
va: 1.0993 1.1200 1.1224 1.1250 1.0985 1.9465 2.0405 2.8796 3.2825 3.7904 3.9059 3.9262 3.8930 3.8937 3.7955 3.7677 3.8736 4.1598 3.7599 3.8864 4.4462 3.6162 4.0208 3.9209 3.9551 3.9473 3.8901 3.9049 3.8923 1.0212 1.0178 1.0172 1.0162 1.0153 0.9963 1.0121 1.0267 1.0092 1.0089 1.0064 0.9953 1.0057 1.0049 0.9910 0.9914 0.9901
dispcorr: -0.021824570 hartree
energy: -1531.693280199923
dipole: -28.68762 27.71200 -0.97562 -0.73591 0.31519 -0.42072 14.94586 -14.09293 0.85293
magnitude: 1.36247 au
magnitude: 3.46313 debye
