program: Orca
programVersion: 5.0.4
elementType: F F F F F O O N N C C C C C C C C C C C C C C C C C C C C H H H H H H H H H H H H H H H H H
charge: 0
multiplicity: 1
keywords: wb97x-d3
keywords: def2-TZVPP
keywords: def2/J RIJCOSX
keywords: DEFGRID2
keywords: scfconv7
keywords: smallprint printgap noloewdin
keywords: NOSOSCF
formula: C20H17F5N2O2
InChI: InChI=1/C20H17F5N2O2/c21-15-9-8-14(20(23,24)25)17(18(15)22)19(27-29-11-13-6-7-13)26-16(28)10-12-4-2-1-3-5-12/h1-5,8-9,13,26H,6-7,10-11H2
46 atoms
F  1.111092 0.723651 2.088695
F  0.247001 -1.490652 -2.354768
F  2.201249 -1.607113 -3.234598
F  1.629867 -3.019035 -1.728551
F  3.578001 1.728551 1.810613
O  -1.372706 -2.688851 0.895949
O  -0.304383 1.544662 -0.873314
N  -0.102441 -2.25451 0.652729
N  -1.153769 -0.185587 0.327164
C  -0.736927 -4.168528 2.724538
C  -1.531068 -3.76687 3.928704
C  -1.273567 -5.215088 3.651714
C  -1.347705 -4.034238 1.363381
C  -0.055996 -1.02061 0.34641
C  1.298303 -0.474145 0.083773
C  2.07204 -0.810278 -1.02851
C  1.835403 0.384873 1.022341
C  -1.219983 1.055245 -0.251504
C  -2.550044 1.742195 -0.02741
C  3.350993 -0.290055 -1.167959
C  1.53514 -1.732899 -2.083941
C  -2.602292 3.117014 -0.622014
C  3.10752 0.905323 0.876813
C  3.873436 0.570724 -0.216454
C  -1.969959 4.18309 0.013505
C  -3.270553 3.351812 -1.818694
C  -2.007519 5.456556 -0.534137
C  -3.312075 4.626462 -2.369263
C  -2.680151 5.682183 -1.728591
H  0.332319 -3.992144 2.770096
H  -2.535427 -3.390504 3.773712
H  -1.004402 -3.300482 4.751476
H  -2.102544 -5.822615 3.308117
H  -0.568347 -5.743443 4.280206
H  -2.396515 -4.337131 1.379087
H  -0.828415 -4.663968 0.634399
H  -1.995199 -0.543215 0.760905
H  -2.735778 1.779094 1.050522
H  -3.33811 1.108787 -0.445544
H  3.961947 -0.539112 -2.023525
H  4.868414 0.980416 -0.327743
H  -1.447763 4.017752 0.948951
H  -3.767363 2.532311 -2.324796
H  -1.513118 6.275436 -0.027039
H  -3.838348 4.793018 -3.300625
H  -2.712376 6.676333 -2.155902
elementType: F O N C H
totalener: -1531.67264113 hartree
nucrepener: 2860.21178116 hartree
electener: -4391.88442228 hartree
oneelecener: -7791.06800905 hartree
twoeener: 3399.18358677 hartree
cpcmener: -0.03469819 hartree
kineticenergy: 1525.78684219 hartree
xcener: -138.188160308902 hartree
chargesum: -0.0000000
charge: -0.202719 -0.177169 -0.176061 -0.172578 -0.198546 -0.257477 -0.456447 -0.178793 -0.179294 -0.093678 -0.175114 -0.191082 0.069276 0.287016 -0.075207 -0.118222 0.265944 0.336862 -0.053342 -0.084546 0.531919 0.020899 0.202587 -0.170660 -0.214400 -0.189354 -0.149581 -0.158666 -0.161725 0.090447 0.083855 0.093672 0.087481 0.094473 0.091509 0.088745 0.176273 0.132986 0.127396 0.149614 0.156827 0.140667 0.137524 0.155458 0.155922 0.157314
qa: -0.2027 -0.1772 -0.1761 -0.1726 -0.1985 -0.2575 -0.4564 -0.1788 -0.1793 -0.0937 -0.1751 -0.1911 0.0693 0.2870 -0.0752 -0.1182 0.2659 0.3369 -0.0533 -0.0845 0.5319 0.0209 0.2026 -0.1707 -0.2144 -0.1894 -0.1496 -0.1587 -0.1617 0.0904 0.0839 0.0937 0.0875 0.0945 0.0915 0.0887 0.1763 0.1330 0.1274 0.1496 0.1568 0.1407 0.1375 0.1555 0.1559 0.1573
va: 1.1018 1.1231 1.1261 1.1205 1.0982 1.9404 2.0376 2.8732 3.2879 3.7883 3.9012 3.9316 3.8870 3.8883 3.8031 3.7569 3.8777 4.1511 3.7281 3.8881 4.4523 3.5959 4.0231 3.9165 3.9711 3.9597 3.8930 3.9015 3.8954 1.0202 1.0189 1.0174 1.0160 1.0149 0.9972 1.0111 1.0306 1.0043 1.0088 1.0063 0.9954 1.0044 1.0056 0.9914 0.9917 0.9903
dispcorr: -0.021560175 hartree
energy: -1531.694201300825
dipole: -28.72658 27.79589 -0.93069 -0.23136 -0.16162 -0.39298 15.74150 -14.80069 0.94082
magnitude: 1.38049 au
magnitude: 3.50893 debye
