program: Orca
programVersion: 5.0.4
elementType: F F F F F O O N N C C C C C C C C C C C C C C C C C C C C H H H H H H H H H H H H H H H H H
charge: 0
multiplicity: 1
keywords: wb97x-d3
keywords: def2-TZVPP
keywords: def2/J RIJCOSX
keywords: DEFGRID2
keywords: scfconv7
keywords: smallprint printgap noloewdin
keywords: NOSOSCF
formula: C20H17F5N2O2
InChI: InChI=1/C20H17F5N2O2/c21-15-9-8-14(20(23,24)25)17(18(15)22)19(27-29-11-13-6-7-13)26-16(28)10-12-4-2-1-3-5-12/h1-5,8-9,13,26H,6-7,10-11H2
46 atoms
F  1.127542 0.748508 2.094564
F  1.725085 -3.024319 -1.652243
F  0.346124 -1.516861 -2.332396
F  2.313285 -1.643574 -3.182258
F  3.60592 1.749686 1.858244
O  -1.313769 -2.674372 0.920743
O  -0.190025 1.628688 -0.775735
N  -0.039214 -2.21844 0.736853
N  -1.12254 -0.228118 0.148711
C  -0.823046 -4.028226 2.882922
C  -1.765633 -3.611787 3.969301
C  -1.405149 -5.055163 3.804479
C  -1.287648 -3.993084 1.459477
C  -0.003125 -1.011032 0.337303
C  1.35588 -0.460143 0.103973
C  2.148141 -0.803147 -0.992329
C  1.875478 0.401843 1.048137
C  -1.173053 1.016704 -0.424351
C  -2.587527 1.529564 -0.601882
C  3.429558 -0.28373 -1.113701
C  1.632075 -1.746794 -2.038785
C  -2.648248 3.005721 -0.85719
C  3.150169 0.92029 0.922585
C  3.9345 0.580961 -0.156769
C  -2.994978 3.884447 0.164065
C  -2.353319 3.523199 -2.116092
C  -3.049253 5.253056 -0.065114
C  -2.404245 4.89001 -2.347801
C  -2.752424 5.75968 -1.322337
H  0.224792 -3.789345 3.030679
H  -2.764311 -3.302317 3.684128
H  -1.360038 -3.074661 4.817128
H  -2.157924 -5.726986 3.408911
H  -0.74772 -5.509029 4.534951
H  -2.318846 -4.343308 1.380438
H  -0.66754 -4.633126 0.824494
H  -2.00246 -0.650688 0.41463
H  -3.189756 1.263792 0.269937
H  -3.015378 0.976302 -1.444993
H  4.055349 -0.539614 -1.956472
H  4.931549 0.989874 -0.251489
H  -3.23064 3.495869 1.147983
H  -2.09059 2.852552 -2.925666
H  -3.326386 5.922456 0.739347
H  -2.172993 5.277618 -3.331904
H  -2.795083 6.826039 -1.503959
elementType: F O N C H
totalener: -1531.67259332 hartree
nucrepener: 2856.29885274 hartree
electener: -4387.97144606 hartree
oneelecener: -7783.17018257 hartree
twoeener: 3395.19873650 hartree
cpcmener: -0.03380307 hartree
kineticenergy: 1525.78122488 hartree
xcener: -138.187082155776 hartree
chargesum: 0.0000000
charge: -0.201437 -0.172483 -0.177658 -0.175377 -0.198458 -0.258153 -0.458720 -0.178554 -0.168659 -0.092264 -0.175498 -0.190772 0.069765 0.275047 -0.087276 -0.106358 0.279600 0.345316 -0.056702 -0.095139 0.532885 0.036898 0.193407 -0.165917 -0.205562 -0.209564 -0.150262 -0.152501 -0.166418 0.089975 0.082592 0.093786 0.087367 0.094602 0.092162 0.086657 0.175730 0.114021 0.136576 0.150001 0.156843 0.140069 0.140678 0.156124 0.156243 0.157386
qa: -0.2014 -0.1725 -0.1777 -0.1754 -0.1985 -0.2582 -0.4587 -0.1786 -0.1687 -0.0923 -0.1755 -0.1908 0.0698 0.2750 -0.0873 -0.1064 0.2796 0.3453 -0.0567 -0.0951 0.5329 0.0369 0.1934 -0.1659 -0.2056 -0.2096 -0.1503 -0.1525 -0.1664 0.0900 0.0826 0.0938 0.0874 0.0946 0.0922 0.0867 0.1757 0.1140 0.1366 0.1500 0.1568 0.1401 0.1407 0.1561 0.1562 0.1574
va: 1.1036 1.1211 1.1220 1.1277 1.0983 1.9377 2.0428 2.8783 3.2963 3.7877 3.9022 3.9307 3.8846 3.9030 3.8051 3.7446 3.8688 4.1438 3.7626 3.8997 4.4497 3.6042 4.0325 3.9124 3.9565 3.9648 3.8949 3.8929 3.8994 1.0203 1.0191 1.0172 1.0160 1.0149 0.9971 1.0127 1.0333 1.0110 1.0011 1.0061 0.9952 1.0035 1.0066 0.9915 0.9912 0.9905
dispcorr: -0.021454883 hartree
energy: -1531.694048207015
dipole: -30.18319 29.14913 -1.03406 -0.12181 -0.45048 -0.57229 15.07064 -14.68179 0.38885
magnitude: 1.24419 au
magnitude: 3.16247 debye
