program: Orca
programVersion: 5.0.4
elementType: F F F F F O O N N C C C C C C C C C C C C C C C C C C C C H H H H H H H H H H H H H H H H H
charge: 0
multiplicity: 1
keywords: wb97x-d3
keywords: def2-TZVPP
keywords: def2/J RIJCOSX
keywords: DEFGRID2
keywords: scfconv7
keywords: smallprint printgap noloewdin
keywords: NOSOSCF
formula: C20H17F5N2O2
InChI: InChI=1/C20H17F5N2O2/c21-15-9-8-14(20(23,24)25)17(18(15)22)19(27-29-11-13-6-7-13)26-16(28)10-12-4-2-1-3-5-12/h1-5,8-9,13,26H,6-7,10-11H2
46 atoms
F  1.140556 0.65874 2.153503
F  2.259504 -1.410136 -3.267682
F  1.69475 -2.892647 -1.824955
F  0.302886 -1.348401 -2.384479
F  3.621595 1.646221 1.958552
O  -1.263779 -2.737661 0.86069
O  -0.257008 1.631717 -0.724753
N  -0.005184 -2.245977 0.665132
N  -1.13761 -0.250474 0.196683
C  -0.643997 -4.133319 2.755243
C  -1.523534 -3.744162 3.902512
C  -1.167415 -5.182201 3.687053
C  -1.189135 -4.06935 1.361763
C  -0.001876 -1.02106 0.322015
C  1.344515 -0.438204 0.094909
C  2.123304 -0.715166 -1.029347
C  1.874624 0.369197 1.079825
C  -1.221409 1.005732 -0.346491
C  -2.646088 1.507437 -0.458523
C  3.402298 -0.187111 -1.137497
C  1.593736 -1.59256 -2.125114
C  -2.731153 2.975503 -0.747918
C  3.151854 0.886611 0.97273
C  3.922606 0.614452 -0.134838
C  -2.482043 3.462885 -2.028655
C  -3.05624 3.877003 0.260283
C  -2.556034 4.822246 -2.294346
C  -3.134311 5.238499 -0.00296
C  -2.883075 5.714952 -1.281565
H  0.409407 -3.891864 2.849778
H  -2.538311 -3.433636 3.681941
H  -1.071061 -3.222243 4.736244
H  -1.938809 -5.850475 3.321812
H  -0.465626 -5.647167 4.368043
H  -2.218105 -4.433109 1.330685
H  -0.596272 -4.683248 0.676682
H  -2.003214 -0.691625 0.479142
H  -3.194473 1.260621 0.454229
H  -3.120894 0.929956 -1.259315
H  4.016191 -0.389241 -2.003461
H  4.920028 1.025557 -0.216575
H  -2.236053 2.774192 -2.828301
H  -3.25532 3.512183 1.261209
H  -2.360669 5.185967 -3.295141
H  -3.393908 5.926028 0.792017
H  -2.944752 6.77558 -1.489641
elementType: F O N C H
totalener: -1531.67247353 hartree
nucrepener: 2858.05939016 hartree
electener: -4389.73186369 hartree
oneelecener: -7786.71441846 hartree
twoeener: 3396.98255477 hartree
cpcmener: -0.03393488 hartree
kineticenergy: 1525.78713129 hartree
xcener: -138.188160702320 hartree
chargesum: 0.0000000
charge: -0.201605 -0.175233 -0.172514 -0.177421 -0.198392 -0.259014 -0.458521 -0.179800 -0.169747 -0.093528 -0.174311 -0.191249 0.070910 0.278273 -0.087164 -0.104684 0.273794 0.347477 -0.055701 -0.092474 0.531576 0.034672 0.194465 -0.167379 -0.212049 -0.203905 -0.152667 -0.151102 -0.165720 0.090040 0.083118 0.093252 0.087389 0.094629 0.091424 0.087298 0.175799 0.115468 0.137628 0.149646 0.157248 0.140806 0.139660 0.156260 0.155909 0.157437
qa: -0.2016 -0.1752 -0.1725 -0.1774 -0.1984 -0.2590 -0.4585 -0.1798 -0.1697 -0.0935 -0.1743 -0.1912 0.0709 0.2783 -0.0872 -0.1047 0.2738 0.3475 -0.0557 -0.0925 0.5316 0.0347 0.1945 -0.1674 -0.2120 -0.2039 -0.1527 -0.1511 -0.1657 0.0900 0.0831 0.0933 0.0874 0.0946 0.0914 0.0873 0.1758 0.1155 0.1376 0.1496 0.1572 0.1408 0.1397 0.1563 0.1559 0.1574
va: 1.1033 1.1276 1.1213 1.1220 1.0983 1.9371 2.0424 2.8777 3.2977 3.7879 3.9012 3.9313 3.8848 3.8946 3.8146 3.7400 3.8846 4.1413 3.7569 3.8988 4.4506 3.6034 4.0278 3.9132 3.9651 3.9560 3.8932 3.8957 3.8992 1.0206 1.0190 1.0175 1.0159 1.0147 0.9973 1.0120 1.0327 1.0108 1.0011 1.0063 0.9951 1.0065 1.0039 0.9912 0.9916 0.9905
dispcorr: -0.021492898 hartree
energy: -1531.693966430438
dipole: -29.42739 28.42101 -1.00639 -1.25296 0.65815 -0.59482 15.25781 -14.79108 0.46673
magnitude: 1.25875 au
magnitude: 3.19950 debye
