program: Orca
programVersion: 5.0.4
elementType: F F F F F O O N N C C C C C C C C C C C C C C C C C C C C H H H H H H H H H H H H H H H H H
charge: 0
multiplicity: 1
keywords: wb97x-d3
keywords: def2-TZVPP
keywords: def2/J RIJCOSX
keywords: DEFGRID2
keywords: scfconv7
keywords: smallprint printgap noloewdin
keywords: NOSOSCF
formula: C20H17F5N2O2
InChI: InChI=1/C20H17F5N2O2/c21-15-9-8-14(20(23,24)25)17(18(15)22)19(27-29-11-13-6-7-13)26-16(28)10-12-4-2-1-3-5-12/h1-5,8-9,13,26H,6-7,10-11H2
46 atoms
F  1.545929 0.452068 2.282061
F  0.757466 -2.71403 -1.880622
F  -0.310583 -0.881995 -2.232488
F  1.45403 -1.334703 -3.370002
F  4.033043 1.230952 1.666998
O  -1.424947 -2.454327 1.42705
O  -0.212617 1.80703 -0.336461
N  -0.169515 -2.097691 1.026612
N  -1.196226 -0.049887 0.531517
C  -0.817424 -3.841853 3.338947
C  -0.297338 -5.165686 3.813461
C  0.655783 -4.056786 3.500874
C  -1.426667 -3.769248 1.972359
C  -0.115001 -0.903535 0.591254
C  1.233571 -0.460919 0.148628
C  1.755854 -0.716701 -1.120827
C  2.027672 0.191241 1.067998
C  -1.208777 1.225573 0.02992
C  -2.594063 1.837117 -0.006244
C  3.0483 -0.32284 -1.433332
C  0.917284 -1.413548 -2.151072
C  -2.632844 3.101858 -0.809619
C  3.311696 0.593123 0.749133
C  3.831024 0.336094 -0.498325
C  -2.706088 4.343782 -0.189767
C  -2.569096 3.047825 -2.200212
C  -2.715888 5.512041 -0.942028
C  -2.575489 4.211377 -2.954085
C  -2.647505 5.448794 -2.325979
H  -1.303373 -3.223191 4.086898
H  -0.343526 -6.00402 3.128142
H  -0.46036 -5.432641 4.849624
H  1.256781 -4.14113 2.604266
H  1.151889 -3.559128 4.3245
H  -2.48304 -4.042336 2.007386
H  -0.927993 -4.459284 1.283479
H  -2.082721 -0.437256 0.827501
H  -2.903603 2.023752 1.02691
H  -3.298147 1.100828 -0.403907
H  3.469362 -0.516819 -2.408966
H  4.837711 0.649119 -0.740835
H  -2.758307 4.400881 0.891187
H  -2.514273 2.086504 -2.698661
H  -2.775028 6.471532 -0.444024
H  -2.522183 4.153328 -4.033879
H  -2.649526 6.357796 -2.91379
elementType: F O N C H
totalener: -1531.67124824 hartree
nucrepener: 2877.17597810 hartree
electener: -4408.84722634 hartree
oneelecener: -7825.04296979 hartree
twoeener: 3416.19574346 hartree
cpcmener: -0.03391411 hartree
kineticenergy: 1525.78874754 hartree
xcener: -138.188164264773 hartree
chargesum: 0.0000000
charge: -0.201162 -0.172337 -0.178410 -0.174368 -0.198263 -0.257788 -0.458372 -0.166226 -0.162306 -0.074883 -0.207426 -0.157554 0.039022 0.261491 -0.085345 -0.106788 0.282217 0.334538 -0.050478 -0.097028 0.537867 0.019405 0.184246 -0.159753 -0.183962 -0.215081 -0.158585 -0.146495 -0.162121 0.087123 0.088309 0.094649 0.076127 0.093993 0.100355 0.087579 0.174764 0.130557 0.127242 0.151170 0.157489 0.137444 0.139932 0.155621 0.156261 0.157331
qa: -0.2012 -0.1723 -0.1784 -0.1744 -0.1983 -0.2578 -0.4584 -0.1662 -0.1623 -0.0749 -0.2074 -0.1576 0.0390 0.2615 -0.0853 -0.1068 0.2822 0.3345 -0.0505 -0.0970 0.5379 0.0194 0.1842 -0.1598 -0.1840 -0.2151 -0.1586 -0.1465 -0.1621 0.0871 0.0883 0.0946 0.0761 0.0940 0.1004 0.0876 0.1748 0.1306 0.1272 0.1512 0.1575 0.1374 0.1399 0.1556 0.1563 0.1573
va: 1.1038 1.1253 1.1173 1.1302 1.0985 1.9423 2.0365 2.8809 3.2873 3.7720 3.9428 3.8772 3.8911 3.9232 3.8070 3.7392 3.8839 4.1275 3.7375 3.9019 4.4431 3.6025 4.0337 3.9039 3.9577 3.9670 3.9025 3.8882 3.8959 1.0140 1.0145 1.0160 1.0322 1.0159 1.0014 1.0117 1.0338 1.0068 1.0081 1.0051 0.9950 1.0063 1.0048 0.9916 0.9912 0.9902
dispcorr: -0.022038768 hartree
energy: -1531.693287009648
dipole: -22.64525 21.61925 -1.02600 -1.40436 0.85063 -0.55373 14.24023 -13.85213 0.38810
magnitude: 1.22878 au
magnitude: 3.12332 debye
