program: Orca
programVersion: 5.0.4
elementType: F F F F F O O N N C C C C C C C C C C C C C C C C C C C C H H H H H H H H H H H H H H H H H
charge: 0
multiplicity: 1
keywords: wb97x-d3
keywords: def2-TZVPP
keywords: def2/J RIJCOSX
keywords: DEFGRID2
keywords: scfconv7
keywords: smallprint printgap noloewdin
keywords: NOSOSCF
formula: C20H17F5N2O2
InChI: InChI=1/C20H17F5N2O2/c21-15-9-8-14(20(23,24)25)17(18(15)22)19(27-29-11-13-6-7-13)26-16(28)10-12-4-2-1-3-5-12/h1-5,8-9,13,26H,6-7,10-11H2
46 atoms
F  2.542371 1.264725 2.012523
F  0.121659 -0.917977 -1.777201
F  1.686845 -1.850036 -2.912278
F  0.923709 -2.814369 -1.153217
F  5.12247 1.063641 1.346072
O  -1.196609 -0.793606 1.891766
O  1.165418 2.235723 -0.889372
N  0.072901 -1.018833 1.428776
N  -0.233308 1.097183 0.494985
C  -2.213248 -2.825127 1.033777
C  -3.477794 -3.626469 1.077773
C  -3.397041 -2.401949 0.2202
C  -1.832401 -2.018067 2.237225
C  0.509374 -0.03335 0.750337
C  1.906252 -0.150584 0.261439
C  2.284331 -0.913096 -0.843651
C  2.887778 0.506848 0.973416
C  0.084103 2.121622 -0.354647
C  -1.02626 3.135879 -0.543624
C  3.624657 -1.01703 -1.190032
C  1.253652 -1.624099 -1.669914
C  -2.415087 2.561561 -0.491223
C  4.219967 0.40658 0.623358
C  4.598319 -0.359686 -0.455807
C  -2.829371 1.650926 -1.463331
C  -3.294627 2.896077 0.533043
C  -4.095731 1.090894 -1.411682
C  -4.566132 2.337459 0.585376
C  -4.968961 1.433239 -0.38545
H  -1.383622 -3.264173 0.490118
H  -4.078717 -3.576162 1.978154
H  -3.481602 -4.596102 0.596935
H  -3.943872 -1.521634 0.537651
H  -3.346817 -2.529338 -0.853739
H  -1.189308 -2.589228 2.913749
H  -2.72127 -1.716295 2.795064
H  -1.169602 1.087224 0.87931
H  -0.843505 3.631663 -1.498095
H  -0.899804 3.897191 0.232276
H  3.934173 -1.606511 -2.041192
H  5.642606 -0.437087 -0.727431
H  -2.153083 1.376679 -2.265207
H  -2.983901 3.59782 1.298184
H  -4.402556 0.383832 -2.171811
H  -5.239606 2.609116 1.388189
H  -5.957777 0.994694 -0.345015
elementType: F O N C H
totalener: -1531.67097213 hartree
nucrepener: 2977.98526411 hartree
electener: -4509.65623624 hartree
oneelecener: -8026.09078938 hartree
twoeener: 3516.43455314 hartree
cpcmener: -0.02871228 hartree
kineticenergy: 1525.79901292 hartree
xcener: -138.190947767506 hartree
chargesum: -0.0000000
charge: -0.200192 -0.178868 -0.174778 -0.174834 -0.197668 -0.263575 -0.462960 -0.168669 -0.171116 -0.084100 -0.192647 -0.181005 0.072492 0.258541 -0.077905 -0.101653 0.262954 0.353957 -0.054907 -0.097568 0.543419 -0.022676 0.193894 -0.166698 -0.193432 -0.172138 -0.160808 -0.133706 -0.162460 0.088152 0.087832 0.094515 0.082345 0.093936 0.087365 0.094648 0.188641 0.111726 0.114653 0.149401 0.157179 0.141659 0.141138 0.158754 0.158067 0.159098
qa: -0.2002 -0.1789 -0.1748 -0.1748 -0.1977 -0.2636 -0.4630 -0.1687 -0.1711 -0.0841 -0.1926 -0.1810 0.0725 0.2585 -0.0779 -0.1017 0.2630 0.3540 -0.0549 -0.0976 0.5434 -0.0227 0.1939 -0.1667 -0.1934 -0.1721 -0.1608 -0.1337 -0.1625 0.0882 0.0878 0.0945 0.0823 0.0939 0.0874 0.0946 0.1886 0.1117 0.1147 0.1494 0.1572 0.1417 0.1411 0.1588 0.1581 0.1591
va: 1.1044 1.1173 1.1294 1.1179 1.0996 1.9314 2.0429 2.9144 3.2596 3.7717 3.9561 3.8835 3.8667 3.9686 3.7732 3.7456 3.9022 4.1173 3.7900 3.9201 4.4231 3.6520 4.0327 3.9161 3.9305 3.9253 3.8358 3.8735 3.8621 1.0207 1.0165 1.0151 1.0197 1.0183 1.0152 0.9967 1.0297 1.0190 1.0061 1.0063 0.9950 1.0068 1.0042 0.9909 0.9898 0.9899
dispcorr: -0.025549015 hartree
energy: -1531.696521142372
dipole: -41.93471 40.61974 -1.31497 -0.85236 0.73714 -0.11522 5.53262 -5.44843 0.08419
magnitude: 1.32269 au
magnitude: 3.36201 debye
