program: Orca
programVersion: 5.0.4
elementType: F F F F F O O N N C C C C C C C C C C C C C C C C C C C C H H H H H H H H H H H H H H H H H
charge: 0
multiplicity: 1
keywords: wb97x-d3
keywords: def2-TZVPP
keywords: def2/J RIJCOSX
keywords: DEFGRID2
keywords: scfconv7
keywords: smallprint printgap noloewdin
keywords: NOSOSCF
formula: C20H17F5N2O2
InChI: InChI=1/C20H17F5N2O2/c21-15-9-8-14(20(23,24)25)17(18(15)22)19(27-29-11-13-6-7-13)26-16(28)10-12-4-2-1-3-5-12/h1-5,8-9,13,26H,6-7,10-11H2
46 atoms
F  1.009226 0.705267 2.055443
F  0.243334 -1.278598 -2.499225
F  2.224249 -1.706309 -3.210658
F  1.312119 -2.991893 -1.756886
F  3.539802 1.579334 1.892868
O  -1.547385 -2.568242 0.884762
O  -0.206025 1.626976 -0.911932
N  -0.253477 -2.175515 0.702091
N  -1.242054 -0.158382 0.04032
C  -1.231721 -3.825951 2.949947
C  -0.771006 -5.102207 3.587546
C  0.196858 -3.983075 3.370911
C  -1.600389 -3.852133 1.498396
C  -0.16003 -0.983616 0.267195
C  1.2266 -0.493947 0.059069
C  2.024306 -0.859933 -1.025862
C  1.765159 0.330201 1.0250
C  -1.223801 1.069302 -0.566239
C  -2.603019 1.649437 -0.797609
C  3.334269 -0.410036 -1.107626
C  1.454227 -1.712705 -2.121084
C  -2.593004 3.148981 -0.827053
C  3.067468 0.78365 0.936736
C  3.86091 0.412819 -0.124797
C  -2.85884 3.875716 0.329746
C  -2.296625 3.837648 -1.999382
C  -2.834528 5.26344 0.315501
C  -2.271574 5.225085 -2.016982
C  -2.54057 5.9424 -0.859087
H  -1.851644 -3.180963 3.564737
H  -0.681393 -5.980476 2.958884
H  -1.102132 -5.312514 4.596297
H  0.943545 -4.099656 2.595625
H  0.534953 -3.422741 4.23344
H  -2.637905 -4.166177 1.369541
H  -0.967827 -4.555407 0.94636
H  -2.144966 -0.533191 0.299508
H  -3.303844 1.282834 -0.044939
H  -2.947669 1.249395 -1.75708
H  3.966651 -0.684464 -1.939369
H  4.880481 0.768767 -0.188517
H  -3.091042 3.35232 1.250098
H  -2.092625 3.285919 -2.909373
H  -3.047934 5.81457 1.222649
H  -2.04337 5.747146 -2.937609
H  -2.524194 7.024701 -0.872823
elementType: F O N C H
totalener: -1531.67164593 hartree
nucrepener: 2873.12622209 hartree
electener: -4404.79786802 hartree
oneelecener: -7816.95482733 hartree
twoeener: 3412.15695931 hartree
cpcmener: -0.03356266 hartree
kineticenergy: 1525.79304338 hartree
xcener: -138.189127741580 hartree
chargesum: 0.0000000
charge: -0.201819 -0.177902 -0.174787 -0.171742 -0.198511 -0.257397 -0.462632 -0.164107 -0.161430 -0.074473 -0.206038 -0.157834 0.038521 0.263610 -0.075647 -0.113701 0.272021 0.337131 -0.053688 -0.089037 0.533935 0.046417 0.193662 -0.165655 -0.210203 -0.202899 -0.148160 -0.149935 -0.168787 0.086480 0.088138 0.094808 0.076326 0.094141 0.100754 0.088027 0.174468 0.111432 0.127853 0.151201 0.156893 0.140781 0.139333 0.156500 0.156259 0.157689
qa: -0.2018 -0.1779 -0.1748 -0.1717 -0.1985 -0.2574 -0.4626 -0.1641 -0.1614 -0.0745 -0.2060 -0.1578 0.0385 0.2636 -0.0756 -0.1137 0.2720 0.3371 -0.0537 -0.0890 0.5339 0.0464 0.1937 -0.1657 -0.2102 -0.2029 -0.1482 -0.1499 -0.1688 0.0865 0.0881 0.0948 0.0763 0.0941 0.1008 0.0880 0.1745 0.1114 0.1279 0.1512 0.1569 0.1408 0.1393 0.1565 0.1563 0.1577
va: 1.1030 1.1193 1.1288 1.1249 1.0983 1.9440 2.0429 2.8734 3.2979 3.7716 3.9416 3.8780 3.8939 3.9075 3.8046 3.7471 3.8795 4.1513 3.7793 3.8870 4.4505 3.5996 4.0297 3.9108 3.9577 3.9664 3.8901 3.8925 3.9018 1.0141 1.0149 1.0160 1.0318 1.0160 1.0012 1.0106 1.0341 1.0103 1.0038 1.0050 0.9953 1.0029 1.0068 0.9911 0.9910 0.9904
dispcorr: -0.021909601 hartree
energy: -1531.693555527399
dipole: -25.24467 24.20843 -1.03624 0.12448 -0.68533 -0.56086 15.15045 -14.70707 0.44338
magnitude: 1.25894 au
magnitude: 3.19997 debye
