program: Orca
programVersion: 5.0.4
elementType: F F F F F O O N N C C C C C C C C C C C C C C C C C C C C H H H H H H H H H H H H H H H H H
charge: 0
multiplicity: 1
keywords: wb97x-d3
keywords: def2-TZVPP
keywords: def2/J RIJCOSX
keywords: DEFGRID2
keywords: scfconv7
keywords: smallprint printgap noloewdin
keywords: NOSOSCF
formula: C20H17F5N2O2
InChI: InChI=1/C20H17F5N2O2/c21-15-9-8-14(20(23,24)25)17(18(15)22)19(27-29-11-13-6-7-13)26-16(28)10-12-4-2-1-3-5-12/h1-5,8-9,13,26H,6-7,10-11H2
46 atoms
F  1.246294 1.409943 1.742743
F  -0.051697 -2.040911 -1.684654
F  1.739973 -2.282151 -2.836911
F  1.556309 -3.264868 -0.937616
F  3.654576 2.260142 0.934371
O  -1.226125 -2.162869 1.923507
O  -0.548343 1.248261 -1.231831
N  -0.014361 -1.831179 1.394079
N  -1.17501 0.037137 0.581166
C  -0.992731 -4.568015 1.648621
C  -1.575862 -5.891506 2.036501
C  -2.200418 -5.091752 0.935644
C  -1.140179 -3.416902 2.594756
C  -0.053217 -0.75602 0.716173
C  1.240968 -0.305669 0.145525
C  1.891117 -0.9400 -0.913676
C  1.856322 0.779683 0.738387
C  -1.347526 1.025896 -0.348328
C  -2.631822 1.810613 -0.192816
C  3.132658 -0.488909 -1.338389
C  1.278947 -2.129622 -1.592223
C  -2.416295 3.271903 -0.470868
C  3.095218 1.223495 0.315414
C  3.741199 0.592959 -0.723574
C  -2.983632 3.887371 -1.580067
C  -1.631703 4.033898 0.393208
C  -2.778934 5.240753 -1.820389
C  -1.421406 5.382597 0.153333
C  -1.997507 5.991655 -0.955155
H  -0.056821 -4.599371 1.101914
H  -2.104449 -5.959256 2.980096
H  -1.021906 -6.78366 1.775048
H  -3.153614 -4.615447 1.132301
H  -2.07933 -5.438062 -0.082712
H  -0.318562 -3.389414 3.316967
H  -2.074478 -3.495142 3.154301
H  -1.931807 -0.131943 1.230803
H  -3.055954 1.670028 0.803743
H  -3.354222 1.391967 -0.899812
H  3.649321 -0.971401 -2.155644
H  4.70953 0.945012 -1.053055
H  -3.593308 3.306984 -2.262376
H  -1.178338 3.567171 1.260792
H  -3.230094 5.706587 -2.687273
H  -0.808253 5.960552 0.833087
H  -1.836311 7.045709 -1.141889
elementType: F O N C H
totalener: -1531.67168715 hartree
nucrepener: 2887.11337775 hartree
electener: -4418.78506490 hartree
oneelecener: -7844.87140963 hartree
twoeener: 3426.08634472 hartree
cpcmener: -0.03449743 hartree
kineticenergy: 1525.78995472 hartree
xcener: -138.188022130258 hartree
chargesum: -0.0000000
charge: -0.202702 -0.177813 -0.175937 -0.174926 -0.198080 -0.255714 -0.460044 -0.159147 -0.159504 -0.092339 -0.191552 -0.174218 0.071241 0.271527 -0.075677 -0.110241 0.260008 0.318221 -0.051133 -0.086219 0.538307 0.012777 0.205267 -0.174549 -0.166580 -0.203026 -0.159471 -0.156390 -0.156541 0.088197 0.087278 0.094489 0.083676 0.092951 0.084721 0.092401 0.176982 0.117327 0.114173 0.148075 0.156651 0.138530 0.140509 0.155382 0.155797 0.157315
qa: -0.2027 -0.1778 -0.1759 -0.1749 -0.1981 -0.2557 -0.4600 -0.1591 -0.1595 -0.0923 -0.1916 -0.1742 0.0712 0.2715 -0.0757 -0.1102 0.2600 0.3182 -0.0511 -0.0862 0.5383 0.0128 0.2053 -0.1745 -0.1666 -0.2030 -0.1595 -0.1564 -0.1565 0.0882 0.0873 0.0945 0.0837 0.0930 0.0847 0.0924 0.1770 0.1173 0.1142 0.1481 0.1567 0.1385 0.1405 0.1554 0.1558 0.1573
va: 1.0987 1.1217 1.1272 1.1160 1.0988 1.9451 2.0421 2.9179 3.2697 3.7927 3.9354 3.8995 3.8883 3.9614 3.8060 3.7431 3.8866 4.1594 3.7706 3.9038 4.4320 3.6242 4.0227 3.9216 3.9454 3.9472 3.9040 3.8916 3.8917 1.0210 1.0163 1.0149 1.0188 1.0179 1.0139 0.9956 1.0273 1.0103 1.0118 1.0069 0.9953 1.0044 1.0083 0.9918 0.9914 0.9901
dispcorr: -0.022458167 hartree
energy: -1531.694145316466
dipole: -27.82505 26.98055 -0.84450 -1.71239 1.54332 -0.16907 9.72475 -8.81225 0.91250
magnitude: 1.25476 au
magnitude: 3.18936 debye
