program: Orca
programVersion: 5.0.4
elementType: F F F F F O O N N C C C C C C C C C C C C C C C C C C C C H H H H H H H H H H H H H H H H H
charge: 0
multiplicity: 1
keywords: wb97x-d3
keywords: def2-TZVPP
keywords: def2/J RIJCOSX
keywords: DEFGRID2
keywords: scfconv7
keywords: smallprint printgap noloewdin
keywords: NOSOSCF
formula: C20H17F5N2O2
InChI: InChI=1/C20H17F5N2O2/c21-15-9-8-14(20(23,24)25)17(18(15)22)19(27-29-11-13-6-7-13)26-16(28)10-12-4-2-1-3-5-12/h1-5,8-9,13,26H,6-7,10-11H2
46 atoms
F  1.547874 1.197588 1.874199
F  1.991371 -3.070458 -1.326934
F  1.095804 -1.424991 -2.386613
F  3.109234 -2.02162 -2.829004
F  4.183977 1.670376 2.050074
O  -1.370207 -1.658878 0.607765
O  1.002971 1.859083 -1.44827
N  -0.008808 -1.581591 0.589132
N  -0.457698 0.506043 -0.355383
C  -3.272287 -2.771837 1.500708
C  -3.865204 -1.514748 2.054562
C  -4.229249 -1.97335 0.672113
C  -1.810578 -2.88471 1.167107
C  0.394709 -0.483798 0.085552
C  1.863551 -0.270493 0.079948
C  2.74849 -0.9069 -0.790744
C  2.378979 0.587311 1.031002
C  -0.126765 1.615589 -1.082204
C  -1.295411 2.511998 -1.444568
C  4.113033 -0.676698 -0.685581
C  2.235559 -1.855607 -1.833087
C  -2.496853 2.419545 -0.546543
C  3.736897 0.825974 1.123942
C  4.611726 0.193441 0.270423
C  -2.457665 2.973763 0.732494
C  -3.653193 1.762271 -0.957438
C  -3.550377 2.873573 1.57944
C  -4.75009 1.661491 -0.110471
C  -4.700717 2.215717 1.160101
H  -3.657573 -3.700874 1.907662
H  -3.234367 -0.639136 2.148435
H  -4.608674 -1.605989 2.836593
H  -3.847907 -1.405938 -0.167841
H  -5.220411 -2.3795 0.512871
H  -1.644135 -3.700846 0.454927
H  -1.237296 -3.108371 2.071968
H  -1.435912 0.365861 -0.137994
H  -1.570103 2.259669 -2.473458
H  -0.909509 3.532464 -1.472619
H  4.811629 -1.165183 -1.34948
H  5.674412 0.379298 0.350817
H  -1.563551 3.488036 1.066319
H  -3.698334 1.326094 -1.948604
H  -3.505603 3.310265 2.568972
H  -5.642295 1.148116 -0.445701
H  -5.554113 2.137647 1.821339
elementType: F O N C H
totalener: -1531.66900482 hartree
nucrepener: 2948.57219375 hartree
electener: -4480.24119857 hartree
oneelecener: -7967.13009708 hartree
twoeener: 3486.88889851 hartree
cpcmener: -0.02843604 hartree
kineticenergy: 1525.77690113 hartree
xcener: -138.190145754867 hartree
chargesum: 0.0000000
charge: -0.201415 -0.173355 -0.176265 -0.175283 -0.197960 -0.234634 -0.467655 -0.183283 -0.169390 -0.065041 -0.186595 -0.192035 0.051054 0.286010 -0.088329 -0.105124 0.255569 0.348385 -0.048009 -0.085423 0.529388 -0.007963 0.202004 -0.170004 -0.205828 -0.187874 -0.122129 -0.159890 -0.168743 0.091956 0.076516 0.095392 0.081370 0.094219 0.088210 0.084472 0.190040 0.115977 0.113239 0.149713 0.157050 0.143270 0.142423 0.157589 0.160598 0.157784
qa: -0.2014 -0.1734 -0.1763 -0.1753 -0.1980 -0.2346 -0.4677 -0.1833 -0.1694 -0.0650 -0.1866 -0.1920 0.0511 0.2860 -0.0883 -0.1051 0.2556 0.3484 -0.0480 -0.0854 0.5294 -0.0080 0.2020 -0.1700 -0.2058 -0.1879 -0.1221 -0.1599 -0.1687 0.0920 0.0765 0.0954 0.0814 0.0942 0.0882 0.0845 0.1900 0.1160 0.1132 0.1497 0.1571 0.1433 0.1424 0.1576 0.1606 0.1578
va: 1.1022 1.1205 1.1229 1.1285 1.0991 1.9600 2.0394 2.9176 3.2766 3.8486 3.8956 3.8991 3.9125 3.8853 3.8332 3.7422 3.8925 4.1318 3.7926 3.8980 4.4630 3.6023 4.0283 3.9184 3.9710 3.8923 3.8451 3.8302 3.8624 1.0139 1.0267 1.0182 1.0233 1.0191 0.9971 1.0049 1.0199 1.0071 1.0176 1.0061 0.9953 1.0033 1.0046 0.9899 0.9895 0.9910
dispcorr: -0.025555164 hartree
energy: -1531.694559984346
dipole: -45.82978 44.53273 -1.29706 3.74918 -3.76548 -0.01630 9.78993 -9.37761 0.41233
magnitude: 1.36111 au
magnitude: 3.45968 debye
