program: Orca
programVersion: 5.0.4
elementType: F F F F F O O N N C C C C C C C C C C C C C C C C C C C C H H H H H H H H H H H H H H H H H
charge: 0
multiplicity: 1
keywords: wb97x-d3
keywords: def2-TZVPP
keywords: def2/J RIJCOSX
keywords: DEFGRID2
keywords: scfconv7
keywords: smallprint printgap noloewdin
keywords: NOSOSCF
formula: C20H17F5N2O2
InChI: InChI=1/C20H17F5N2O2/c21-15-9-8-14(20(23,24)25)17(18(15)22)19(27-29-11-13-6-7-13)26-16(28)10-12-4-2-1-3-5-12/h1-5,8-9,13,26H,6-7,10-11H2
46 atoms
F  1.32097 1.665178 1.533625
F  3.174681 -2.304585 -2.436252
F  1.909744 -3.104416 -0.90157
F  1.146299 -1.629304 -2.273916
F  3.934197 2.137826 1.820276
O  -1.408652 -1.724694 0.517956
O  0.750586 1.670008 -1.840768
N  -0.068407 -1.503273 0.597923
N  -0.621511 0.505954 -0.460909
C  -2.961393 -3.502726 0.474773
C  -3.951065 -4.313966 1.251654
C  -4.331804 -2.959209 0.744005
C  -1.778511 -2.92969 1.186382
C  0.277126 -0.405918 0.05266
C  1.731177 -0.118011 0.066092
C  2.66822 -0.883259 -0.634242
C  2.191386 0.906424 0.869375
C  -0.344861 1.508731 -1.347154
C  -1.540493 2.374897 -1.693761
C  4.023739 -0.627406 -0.489235
C  2.22117 -1.980898 -1.557799
C  -2.428631 2.687973 -0.520134
C  3.544002 1.155286 1.012826
C  4.467898 0.389611 0.341134
C  -2.000178 3.592543 0.449967
C  -3.662493 2.064698 -0.358533
C  -2.788455 3.867634 1.556227
C  -4.452254 2.335789 0.752527
C  -4.017266 3.2375 1.711833
H  -2.759466 -3.830177 -0.540169
H  -3.78923 -4.430834 2.316447
H  -4.376246 -5.184655 0.769569
H  -4.429418 -2.154559 1.463153
H  -5.022172 -2.898883 -0.087702
H  -0.936887 -3.626311 1.168405
H  -2.015409 -2.713525 2.234373
H  -1.582228 0.392893 -0.163352
H  -2.105934 1.852633 -2.471651
H  -1.1543 3.289463 -2.1444
H  4.760887 -1.212564 -1.019569
H  5.524887 0.587526 0.45874
H  -1.042103 4.086895 0.336337
H  -4.010569 1.360213 -1.105243
H  -2.443767 4.574822 2.299894
H  -5.409052 1.841837 0.864597
H  -4.632956 3.451773 2.576008
elementType: F O N C H
totalener: -1531.67075018 hartree
nucrepener: 2906.04424766 hartree
electener: -4437.71499784 hartree
oneelecener: -7882.30555008 hartree
twoeener: 3444.59055224 hartree
cpcmener: -0.02996138 hartree
kineticenergy: 1525.78661186 hartree
xcener: -138.187730524815 hartree
chargesum: 0.0000000
charge: -0.201535 -0.176610 -0.171478 -0.177194 -0.198210 -0.246815 -0.460357 -0.159680 -0.174496 -0.077828 -0.198309 -0.176782 0.067845 0.260335 -0.083797 -0.130212 0.266613 0.336220 -0.060712 -0.077576 0.536458 -0.003056 0.209170 -0.173556 -0.208418 -0.199605 -0.133588 -0.138114 -0.165657 0.092850 0.087209 0.096330 0.086056 0.094740 0.082543 0.080568 0.194957 0.122939 0.108273 0.149478 0.156900 0.142841 0.146879 0.158145 0.157762 0.158475
qa: -0.2015 -0.1766 -0.1715 -0.1772 -0.1982 -0.2468 -0.4604 -0.1597 -0.1745 -0.0778 -0.1983 -0.1768 0.0678 0.2603 -0.0838 -0.1302 0.2666 0.3362 -0.0607 -0.0776 0.5365 -0.0031 0.2092 -0.1736 -0.2084 -0.1996 -0.1336 -0.1381 -0.1657 0.0929 0.0872 0.0963 0.0861 0.0947 0.0825 0.0806 0.1950 0.1229 0.1083 0.1495 0.1569 0.1428 0.1469 0.1581 0.1578 0.1585
va: 1.1009 1.1251 1.1209 1.1227 1.0985 1.9671 2.0454 2.9186 3.2576 3.8503 3.9302 3.8847 3.8892 3.9232 3.8132 3.7689 3.8774 4.1449 3.7797 3.8780 4.4451 3.6121 4.0201 3.9222 3.9489 3.9097 3.8767 3.8834 3.9048 1.0102 1.0168 1.0154 1.0176 1.0164 1.0132 0.9949 1.0145 1.0034 1.0214 1.0061 0.9954 1.0041 1.0027 0.9898 0.9904 0.9900
dispcorr: -0.022821215 hartree
energy: -1531.693571393597
dipole: -44.01547 42.71921 -1.29625 -1.22431 1.14319 -0.08112 8.83715 -8.15891 0.67824
magnitude: 1.46522 au
magnitude: 3.72429 debye
