program: Orca
programVersion: 5.0.4
elementType: F F F F F O O N N C C C C C C C C C C C C C C C C C C C C H H H H H H H H H H H H H H H H H
charge: 0
multiplicity: 1
keywords: wb97x-d3
keywords: def2-TZVPP
keywords: def2/J RIJCOSX
keywords: DEFGRID2
keywords: scfconv7
keywords: smallprint printgap noloewdin
keywords: NOSOSCF
formula: C20H17F5N2O2
InChI: InChI=1/C20H17F5N2O2/c21-15-9-8-14(20(23,24)25)17(18(15)22)19(27-29-11-13-6-7-13)26-16(28)10-12-4-2-1-3-5-12/h1-5,8-9,13,26H,6-7,10-11H2
46 atoms
F  1.476678 1.298982 1.852332
F  3.144777 -1.949403 -2.794513
F  2.060477 -3.010288 -1.277914
F  1.11286 -1.41105 -2.362893
F  4.096759 1.863502 2.015184
O  -1.331434 -1.761084 0.464582
O  0.935068 1.826502 -1.552772
N  0.017648 -1.582814 0.550425
N  -0.496006 0.489933 -0.400974
C  -3.119929 -3.27397 0.676143
C  -4.071208 -3.914187 1.639366
C  -4.276094 -2.492372 1.22284
C  -1.733491 -2.953742 1.132732
C  0.383418 -0.461312 0.072472
C  1.842278 -0.191632 0.086073
C  2.74804 -0.814436 -0.77415
C  2.327186 0.702011 1.019099
C  -0.191353 1.566575 -1.188754
C  -1.392121 2.385015 -1.618553
C  4.103125 -0.533624 -0.67845
C  2.265445 -1.79602 -1.801468
C  -2.457899 2.541803 -0.569476
C  3.677256 0.988196 1.104745
C  4.572032 0.372379 0.259752
C  -2.241699 3.382196 0.52155
C  -3.659673 1.844694 -0.652848
C  -3.207179 3.522874 1.506165
C  -4.628196 1.98292 0.334197
C  -4.403789 2.821672 1.41556
H  -3.196498 -3.593356 -0.358137
H  -3.723751 -4.104863 2.647613
H  -4.746126 -4.666854 1.252976
H  -4.066147 -1.713868 1.946687
H  -5.095067 -2.266811 0.551836
H  -1.042212 -3.763911 0.883504
H  -1.701399 -2.802953 2.21771
H  -1.473099 0.32276 -0.19616
H  -1.805562 1.89644 -2.506601
H  -1.017288 3.356805 -1.941119
H  4.817991 -1.007255 -1.335843
H  5.627505 0.59856 0.331434
H  -1.310662 3.932241 0.598868
H  -3.842452 1.190414 -1.497496
H  -3.02684 4.182341 2.345557
H  -5.559223 1.436347 0.25349
H  -5.158038 2.932886 2.184006
elementType: F O N C H
totalener: -1531.67191857 hartree
nucrepener: 2908.02865269 hartree
electener: -4439.70057126 hartree
oneelecener: -7886.21546858 hartree
twoeener: 3446.51489732 hartree
cpcmener: -0.02954354 hartree
kineticenergy: 1525.78731302 hartree
xcener: -138.188007349642 hartree
chargesum: -0.0000000
charge: -0.200885 -0.175460 -0.172725 -0.176302 -0.197991 -0.245942 -0.461810 -0.165794 -0.171888 -0.088249 -0.198622 -0.173211 0.063832 0.256480 -0.091840 -0.111345 0.274135 0.348832 -0.060101 -0.090563 0.534480 -0.013826 0.198167 -0.167156 -0.198792 -0.189079 -0.138562 -0.147872 -0.158517 0.093394 0.089005 0.097024 0.086106 0.094679 0.086676 0.080552 0.193216 0.120414 0.109812 0.149847 0.157305 0.143081 0.145235 0.158222 0.157611 0.158426
qa: -0.2009 -0.1755 -0.1727 -0.1763 -0.1980 -0.2459 -0.4618 -0.1658 -0.1719 -0.0882 -0.1986 -0.1732 0.0638 0.2565 -0.0918 -0.1113 0.2741 0.3488 -0.0601 -0.0906 0.5345 -0.0138 0.1982 -0.1672 -0.1988 -0.1891 -0.1386 -0.1479 -0.1585 0.0934 0.0890 0.0970 0.0861 0.0947 0.0867 0.0806 0.1932 0.1204 0.1098 0.1498 0.1573 0.1431 0.1452 0.1582 0.1576 0.1584
va: 1.1030 1.1279 1.1209 1.1230 1.0986 1.9610 2.0439 2.9138 3.2684 3.8604 3.9388 3.8740 3.8902 3.9319 3.8326 3.7437 3.8845 4.1270 3.7869 3.9036 4.4512 3.6239 4.0259 3.9135 3.9535 3.9022 3.8774 3.8764 3.8976 1.0110 1.0161 1.0158 1.0188 1.0165 1.0085 0.9976 1.0188 1.0038 1.0200 1.0062 0.9952 1.0030 1.0033 0.9900 0.9908 0.9899
dispcorr: -0.023049684 hartree
energy: -1531.694968253752
dipole: -45.50066 44.14364 -1.35701 -0.54605 0.47646 -0.06958 9.62035 -9.22429 0.39606
magnitude: 1.41534 au
magnitude: 3.59751 debye
