program: Orca
programVersion: 5.0.4
elementType: F F F F F O O N N C C C C C C C C C C C C C C C C C C C C H H H H H H H H H H H H H H H H H
charge: 0
multiplicity: 1
keywords: wb97x-d3
keywords: def2-TZVPP
keywords: def2/J RIJCOSX
keywords: DEFGRID2
keywords: scfconv7
keywords: smallprint printgap noloewdin
keywords: NOSOSCF
formula: C20H17F5N2O2
InChI: InChI=1/C20H17F5N2O2/c21-15-9-8-14(20(23,24)25)17(18(15)22)19(27-29-11-13-6-7-13)26-16(28)10-12-4-2-1-3-5-12/h1-5,8-9,13,26H,6-7,10-11H2
46 atoms
F  2.49822 -0.107305 -2.335886
F  1.458127 0.017813 3.478831
F  -0.008713 0.457957 1.976786
F  0.505394 -1.584269 2.40945
F  5.063057 -0.093294 -1.573065
O  -1.366886 -1.479943 -1.275099
O  1.217518 2.413526 -0.423473
N  -0.103338 -1.49487 -0.754259
N  -0.314878 0.824154 -0.963303
C  -2.359052 -3.261866 0.065914
C  -2.538094 -4.7365 0.263827
C  -1.407358 -4.024264 0.934729
C  -1.934959 -2.783834 -1.289361
C  0.375399 -0.321664 -0.631057
C  1.767747 -0.252438 -0.116219
C  2.095739 -0.298769 1.239044
C  2.790575 -0.182923 -1.038734
C  0.101147 2.115688 -0.789127
C  -0.940511 3.158818 -1.137832
C  3.425641 -0.298569 1.633725
C  1.014159 -0.352942 2.276258
C  -2.353954 2.771569 -0.803095
C  4.114454 -0.172247 -0.642783
C  4.440748 -0.237589 0.692571
C  -2.738988 2.626954 0.529435
C  -3.289006 2.526704 -1.803338
C  -4.032239 2.248272 0.852133
C  -4.586644 2.14774 -1.481849
C  -4.960601 2.007084 -0.15399
H  -3.073896 -2.618936 0.570168
H  -2.305727 -5.390806 -0.568606
H  -3.371503 -5.071299 0.868081
H  -0.405412 -4.195138 0.561498
H  -1.465094 -3.870996 2.004856
H  -2.799856 -2.688083 -1.949097
H  -1.239198 -3.490841 -1.754359
H  -1.26505 0.678686 -1.280474
H  -0.845199 3.362775 -2.208769
H  -0.65535 4.075493 -0.619518
H  3.69471 -0.341363 2.679336
H  5.478473 -0.234671 0.997724
H  -2.020454 2.814126 1.31969
H  -3.001344 2.632924 -2.842834
H  -4.317838 2.140125 1.890709
H  -5.303838 1.963638 -2.271578
H  -5.971247 1.712907 0.098523
elementType: F O N C H
totalener: -1531.67098248 hartree
nucrepener: 2956.41585093 hartree
electener: -4488.08683341 hartree
oneelecener: -7983.20284182 hartree
twoeener: 3495.11600841 hartree
cpcmener: -0.02880826 hartree
kineticenergy: 1525.79255676 hartree
xcener: -138.189520600227 hartree
chargesum: -0.0000000
charge: -0.200103 -0.174418 -0.176598 -0.168960 -0.198441 -0.253950 -0.462435 -0.161214 -0.168774 -0.064916 -0.205786 -0.167997 0.035912 0.255358 -0.075818 -0.098247 0.264805 0.350837 -0.054814 -0.100686 0.534942 -0.017446 0.186944 -0.162257 -0.208901 -0.179808 -0.135476 -0.141779 -0.161862 0.087600 0.086731 0.094848 0.077969 0.092403 0.101339 0.087125 0.191052 0.116625 0.111043 0.150266 0.157539 0.141297 0.141947 0.158336 0.157862 0.157907
qa: -0.2001 -0.1744 -0.1766 -0.1690 -0.1984 -0.2539 -0.4624 -0.1612 -0.1688 -0.0649 -0.2058 -0.1680 0.0359 0.2554 -0.0758 -0.0982 0.2648 0.3508 -0.0548 -0.1007 0.5349 -0.0174 0.1869 -0.1623 -0.2089 -0.1798 -0.1355 -0.1418 -0.1619 0.0876 0.0867 0.0948 0.0780 0.0924 0.1013 0.0871 0.1911 0.1166 0.1110 0.1503 0.1575 0.1413 0.1419 0.1583 0.1579 0.1579
va: 1.1052 1.1304 1.1199 1.1213 1.0983 1.9430 2.0428 2.9081 3.2620 3.7705 3.9499 3.8767 3.8867 3.9562 3.7917 3.7296 3.9110 4.1190 3.7851 3.9174 4.4291 3.6389 4.0334 3.9089 3.9551 3.9216 3.8715 3.8839 3.9046 1.0142 1.0152 1.0160 1.0305 1.0188 1.0006 1.0120 1.0238 1.0051 1.0198 1.0058 0.9948 1.0080 1.0042 0.9901 0.9906 0.9901
dispcorr: -0.024138742 hartree
energy: -1531.695121217351
dipole: -36.21112 34.90604 -1.30507 -6.88897 6.71901 -0.16996 -6.17621 6.06152 -0.11469
magnitude: 1.32108 au
magnitude: 3.35792 debye
