program: Orca
programVersion: 5.0.4
elementType: F F F F F O O N N C C C C C C C C C C C C C C C C C C C C H H H H H H H H H H H H H H H H H
charge: 0
multiplicity: 1
keywords: wb97x-d3
keywords: def2-TZVPP
keywords: def2/J RIJCOSX
keywords: DEFGRID2
keywords: scfconv7
keywords: smallprint printgap noloewdin
keywords: NOSOSCF
formula: C20H17F5N2O2
InChI: InChI=1/C20H17F5N2O2/c21-15-9-8-14(20(23,24)25)17(18(15)22)19(27-29-11-13-6-7-13)26-16(28)10-12-4-2-1-3-5-12/h1-5,8-9,13,26H,6-7,10-11H2
46 atoms
F  1.384851 1.627556 1.485685
F  1.877721 -3.184288 -0.879581
F  1.103853 -1.721856 -2.258219
F  3.120824 -2.423762 -2.45204
F  4.008765 2.080039 1.716898
O  -1.423475 -1.698005 0.553389
O  0.825009 1.601344 -1.878258
N  -0.075309 -1.513358 0.619286
N  -0.582552 0.474702 -0.499933
C  -3.213421 -3.18523 0.897945
C  -4.126799 -3.791732 1.917831
C  -4.34655 -2.383699 1.46308
C  -1.810853 -2.853853 1.292367
C  0.294037 -0.440516 0.042176
C  1.753481 -0.182238 0.041185
C  2.668041 -0.969961 -0.661633
C  2.237483 0.848333 0.822138
C  -0.283581 1.448505 -1.412317
C  -1.472527 2.295142 -1.823251
C  4.029092 -0.727393 -0.543792
C  2.189991 -2.075474 -1.559415
C  -2.402438 2.631833 -0.689616
C  3.594294 1.085493 0.93688
C  4.497899 0.298552 0.261051
C  -3.620207 1.975764 -0.534455
C  -2.027682 3.586052 0.254525
C  -4.444475 2.260137 0.547623
C  -2.851178 3.875326 1.331223
C  -4.061273 3.209193 1.483205
H  -3.328839 -3.538559 -0.121473
H  -3.740168 -3.950788 2.917229
H  -4.817099 -4.555011 1.583145
H  -4.107063 -1.582843 2.152378
H  -5.191362 -2.178119 0.818267
H  -1.132857 -3.680241 1.060261
H  -1.74193 -2.651425 2.367038
H  -1.551725 0.368526 -0.227476
H  -2.0066 1.742775 -2.602675
H  -1.079053 3.198601 -2.289577
H  4.750202 -1.328462 -1.078395
H  5.55871 0.488368 0.355707
H  -3.926866 1.234112 -1.263219
H  -1.083473 4.107187 0.14462
H  -5.386657 1.738076 0.656495
H  -2.548015 4.620912 2.055198
H  -4.703029 3.432293 2.325881
elementType: F O N C H
totalener: -1531.67177410 hartree
nucrepener: 2910.74078365 hartree
electener: -4442.41255775 hartree
oneelecener: -7891.66991374 hartree
twoeener: 3449.25735599 hartree
cpcmener: -0.02990398 hartree
kineticenergy: 1525.79281895 hartree
xcener: -138.188996403730 hartree
chargesum: 0.0000000
charge: -0.201510 -0.171463 -0.177272 -0.176194 -0.198201 -0.245173 -0.460080 -0.163287 -0.175823 -0.090216 -0.197957 -0.173223 0.064470 0.260207 -0.080565 -0.129504 0.264884 0.339375 -0.059836 -0.079643 0.537207 -0.002091 0.207984 -0.172268 -0.199739 -0.206124 -0.143492 -0.134834 -0.162528 0.093885 0.088849 0.096777 0.086220 0.094933 0.086685 0.080450 0.196061 0.123026 0.108104 0.149311 0.156888 0.147458 0.143429 0.157629 0.158253 0.158939
qa: -0.2015 -0.1715 -0.1773 -0.1762 -0.1982 -0.2452 -0.4601 -0.1633 -0.1758 -0.0902 -0.1980 -0.1732 0.0645 0.2602 -0.0806 -0.1295 0.2649 0.3394 -0.0598 -0.0796 0.5372 -0.0021 0.2080 -0.1723 -0.1997 -0.2061 -0.1435 -0.1348 -0.1625 0.0939 0.0888 0.0968 0.0862 0.0949 0.0867 0.0804 0.1961 0.1230 0.1081 0.1493 0.1569 0.1475 0.1434 0.1576 0.1583 0.1589
va: 1.1014 1.1214 1.1224 1.1259 1.0986 1.9624 2.0460 2.9140 3.2615 3.8603 3.9371 3.8765 3.8926 3.9216 3.8181 3.7688 3.8809 4.1392 3.7847 3.8829 4.4453 3.6119 4.0201 3.9210 3.9027 3.9506 3.8796 3.8789 3.9016 1.0111 1.0162 1.0157 1.0187 1.0163 1.0075 0.9976 1.0152 1.0031 1.0215 1.0061 0.9954 1.0026 1.0033 0.9906 0.9897 0.9898
dispcorr: -0.023045841 hartree
energy: -1531.694819936413
dipole: -44.53744 43.21093 -1.32651 1.09618 -1.11105 -0.01487 10.69476 -10.06648 0.62828
magnitude: 1.46785 au
magnitude: 3.73097 debye
